Heptane, 2,4,4-trimethyl-
- Formula: C10H22
- Molecular weight: 142.2817
- IUPAC Standard InChIKey: QALGVLROELGEEM-UHFFFAOYSA-N
- CAS Registry Number: 4032-92-2
- Chemical structure:
View 3d structure (requires JavaScript / HTML 5) - Other names: 2,4,4-Trimethylheptane

Phase change data

Data compiled as indicated in comments:
TRC - Thermodynamics Research Center, NIST Boulder Laboratories, Chris Muzny director
AC - William E. Acree, Jr., James S. Chickos
Quantity | Value | Units | Method | Reference | Comment |
---|---|---|---|---|---|
Tboil | 422.7 | K | N/A | Petrov, Sushchinskii, et al., 1957 | Uncertainty assigned by TRC = 1. K; TRC |
Quantity | Value | Units | Method | Reference | Comment |
ΔvapH° | 45.2 | kJ/mol | N/A | Reid, 1972 | AC |

Kovats' RI, non-polar column, isothermal

Data compiled by: NIST Mass Spectrometry Data Center, William E. Wallace, director

Column type CapillaryCapillaryCapillaryCapillary
Active phase SqualaneSqualaneVacuum Grease Oil (VM-4)Squalane
Column length (m)   150.91.4
Carrier gas   N2N2
Substrate
Column diameter (mm)   0.250.25
Phase thickness (μm)
Temperature (C) 100.60.95.60.
I 889.889.4892.2889.
ReferenceHeinzen, Soares, et al., 1999Chretien and Dubois, 1976Sultanov and Arustamova, 1975Matukuma, 1969
Comment MSDC-RI MSDC-RI MSDC-RI MSDC-RI

Kovats' RI, non-polar column, custom temperature program

Data compiled by: NIST Mass Spectrometry Data Center, William E. Wallace, director

Column type Capillary
Active phase Squalane
Column length (m)
Carrier gas
Substrate
Column diameter (mm)
Phase thickness (μm)
Program not specified
I 887.
ReferenceKorol and Lysyuk, 1980
Comment MSDC-RI

References

Petrov, Sushchinskii, et al., 1957
Petrov, A.D.; Sushchinskii, V.L.; Zakharov, E.P.; Rogozhnikova, T.I.,
Synthesis of Branched ALiphatic C10-C15 Hydrocarbons by the Grignard and the Grignard-Wurtz Reactions,
Zh. Obshch. Khim., 1957, 27, 467. [all data]
Reid, 1972
Reid, Robert C.,
Handbook on vapor pressure and heats of vaporization of hydrocarbons and related compounds, R. C. Wilhort and B. J. Zwolinski, Texas A Research Foundation. College Station, Texas(1971). 329 pages.$10.00,
AIChE J., 1972, 18, 6, 1278-1278, https://doi.org/10.1002/aic.690180637
. [all data]