Cyclopentanol, 1,2-dimethyl-3-(1-methylethenyl)-, [1R-(1α,2α,3α)]-
- Formula: C10H18O
- Molecular weight: 154.2493
- IUPAC Standard InChIKey: ZRVPDCMGGOSDKG-UHFFFAOYSA-N
- CAS Registry Number: 4028-60-8
- Chemical structure:
View 3d structure (requires JavaScript / HTML 5) - Species with the same structure:
- Other names: Cyclopentanol, 3-isopropenyl-1,2-dimethyl-, (1R,2S,3S)-(-)-; Plinol C; 3-Isopropenyl-1,2-dimethylcyclopentanol, (1R,2S,3S)-; Cyclopentanol, 1,2-dimethyl-3-(1-methylethenyl)-, (1R,2S,3S)-

Van Den Dool and Kratz RI, non-polar column, temperature ramp

Column type | Active phase | I | Reference | Comment |
---|---|---|---|---|
Capillary | Equity-5 | 1155. | Rocha, Coelho, et al., 2007 | 60. m/0.25 mm/1. μm, He, 40. C @ 1. min, 5. K/min, 260. C @ 15. min |

References

Rocha, Coelho, et al., 2007
Rocha, S.M.; Coelho, E.; Zrostlikova, J.; Delgadillo, I.; Coimbra b, M.A.,
Comprehensive two-dimensional gas chromatography with time-of-flight mass spectrometry of monoterpenoids as a powerful tool for grape origin traceability,
J. Chromatogr. A, 2007, 1161, 1-2, 292-299, https://doi.org/10.1016/j.chroma.2007.05.093
. [all data]