Butane, 2,3-dichloro-, (R*,S*)-
- Formula: C4H8Cl2
- Molecular weight: 127.012
- IUPAC Standard InChIKey: RMISVOPUIFJTEO-ZXZARUISSA-N
- CAS Registry Number: 4028-56-2
- Chemical structure:
View 3d structure (requires JavaScript / HTML 5) - Species with the same structure:
- Stereoisomers:
- Other names: Butane, 2,3-dichloro-, meso-; meso-2,3-Dichlorobutane

Gas phase thermochemistry data

Data compiled by: Hussein Y. Afeefy, Joel F. Liebman, and Stephen E. Stein
Quantity | Value | Units | Method | Reference | Comment |
---|---|---|---|---|---|
ΔfH°gas | -202.3 ± 1.7 | kJ/mol | Ccb | He, An, et al., 1993 |

Condensed phase thermochemistry data

Data compiled by: Hussein Y. Afeefy, Joel F. Liebman, and Stephen E. Stein
Quantity | Value | Units | Method | Reference | Comment |
---|---|---|---|---|---|
ΔfH°liquid | -240.8 ± 1.7 | kJ/mol | Ccb | He, An, et al., 1993 | |
Quantity | Value | Units | Method | Reference | Comment |
ΔcH°liquid | -2523.9 ± 1.7 | kJ/mol | Ccb | He, An, et al., 1993 |

Phase change data

Data compiled as indicated in comments:
ALS - Hussein Y. Afeefy, Joel F. Liebman, and Stephen E. Stein
AC - William E. Acree, Jr., James S. Chickos
Quantity | Value | Units | Method | Reference | Comment |
---|---|---|---|---|---|
ΔvapH° | 38.41 ± 0.07 | kJ/mol | V | He, An, et al., 1993 | ALS |
ΔvapH° | 38.4 | kJ/mol | C | He, An, et al., 1992 | See also He, An, et al., 1993, 2.; AC |

Reaction thermochemistry data

Data compiled by: Hussein Y. Afeefy, Joel F. Liebman, and Stephen E. Stein
Individual Reactions
By formula: C4H8Cl2 = C4H8Cl2
Quantity | Value | Units | Method | Reference | Comment |
---|---|---|---|---|---|
ΔrH° | -1.13 ± 0.21 | kJ/mol | Eqk | Pavskii, Batarova, et al., 1971 | gas phase |

References

He, An, et al., 1993
He, J.; An, X.-W.; Hu, R.-H.,
Measurements of enthalpies of formation of 2,3-dichlorobutane in gaseous state,
Acta Chim. Sin., 1993, 51, 1059-1065. [all data]
He, An, et al., 1992
He, J.; An, X.-W.; Hu, R.-H.,
Enthalpies of vaporization of five dichlorobutanes,
Acta Chim. Sin., 1992, 50, 10, 943. [all data]
He, An, et al., 1993, 2
He, J.; An, X.; Hu, R.,
Measurements of enthalpies of formation of 2,3-dichlorobutane in gaseous state,
Huaxue Xuebao, 1993, 51, 11, 1059. [all data]
Pavskii, Batarova, et al., 1971
Pavskii, V.I.; Batarova, N.I.; Rozhnov, A.M.,
Meso-dl-isomerization of 2,3-dichlorobutane,
Zh. Org. Khim., 1971, 7, 1325-1327. [all data]