4-Nitro-α,α,α-trifluorotoluene
- Formula: C7H4F3NO2
- Molecular weight: 191.1074
- IUPAC Standard InChIKey: XKYLCLMYQDFGKO-UHFFFAOYSA-N
- CAS Registry Number: 402-54-0
- Chemical structure:
View 3d structure (requires JavaScript / HTML 5) - Other names: 4-Nitrobenzotrifluoride; p-Nitrobenzotrifluoride; Benzene, 1-nitro-4-(trifluoromethyl)-; Toluene, 4-nitro-α,α,α-trifluoro-; p-Nitro(trifluoromethyl)benzene; 4-(Trifluoromethyl)nitrobenzene; 1-Nitro-4-(trifluoromethyl)benzene; 4-Nitro-alpha,alpha,alpha-trifluorotoluene; NSC 159121

Phase change data

Data compiled by: Robert L. Brown and Stephen E. Stein
Reduced pressure boiling point
Tboil (K) | Pressure (bar) | Reference |
---|---|---|
354. to 355. | 0.013 | PCR Inc., 1990 |

Reaction thermochemistry data

Data compiled as indicated in comments:
B - John E. Bartmess
M - Michael M. Meot-Ner (Mautner) and Sharon G. Lias
Individual Reactions
By formula: Br- + C7H4F3NO2 = (Br- • C7H4F3NO2)
Quantity | Value | Units | Method | Reference | Comment |
---|---|---|---|---|---|
ΔrH° | 68.6 ± 7.5 | kJ/mol | IMRE | Paul and Kebarle, 1991 | gas phase; ΔGaff at 423 K, ΔSaff taken as that of mCF3-nitrobenzene..Br-; B,M |
Quantity | Value | Units | Method | Reference | Comment |
ΔrS° | 92. | J/mol*K | N/A | Paul and Kebarle, 1991 | gas phase; Entropy change calculated or estimated; M |
Quantity | Value | Units | Method | Reference | Comment |
ΔrG° | 29. ± 4.2 | kJ/mol | IMRE | Paul and Kebarle, 1991 | gas phase; ΔGaff at 423 K, ΔSaff taken as that of mCF3-nitrobenzene..Br-; B |
Free energy of reaction
ΔrG° (kJ/mol) | T (K) | Method | Reference | Comment |
---|---|---|---|---|
29. | 423. | PHPMS | Paul and Kebarle, 1991 | gas phase; Entropy change calculated or estimated; M |

Gas phase ion energetics data

Data compiled by: John E. Bartmess
Electron affinity determinations
EA (eV) | Method | Reference | Comment |
---|---|---|---|
1.50 ± 0.10 | IMRE | Chowdhury, Kishi, et al., 1989 | ΔGea(423 K) = -33.8 kcal/mol, ΔS = -2 eu est |
1.466 ± 0.087 | IMRE | Huh, Kang, et al., 1999 | ΔG(EA) 343K; anchored to ΔG value. Including anchor ΔS, EA is ca. 0.4 kcal/mol more bound. |

Ion clustering data

Data compiled as indicated in comments:
B - John E. Bartmess
M - Michael M. Meot-Ner (Mautner) and Sharon G. Lias
Clustering reactions
By formula: Br- + C7H4F3NO2 = (Br- • C7H4F3NO2)
Quantity | Value | Units | Method | Reference | Comment |
---|---|---|---|---|---|
ΔrH° | 68.6 ± 7.5 | kJ/mol | IMRE | Paul and Kebarle, 1991 | gas phase; ΔGaff at 423 K, ΔSaff taken as that of mCF3-nitrobenzene..Br-; B,M |
Quantity | Value | Units | Method | Reference | Comment |
ΔrS° | 92. | J/mol*K | N/A | Paul and Kebarle, 1991 | gas phase; Entropy change calculated or estimated; M |
Quantity | Value | Units | Method | Reference | Comment |
ΔrG° | 29. ± 4.2 | kJ/mol | IMRE | Paul and Kebarle, 1991 | gas phase; ΔGaff at 423 K, ΔSaff taken as that of mCF3-nitrobenzene..Br-; B |
Free energy of reaction
ΔrG° (kJ/mol) | T (K) | Method | Reference | Comment |
---|---|---|---|---|
29. | 423. | PHPMS | Paul and Kebarle, 1991 | gas phase; Entropy change calculated or estimated; M |

References

PCR Inc., 1990
PCR Inc.,
Research Chemicals Catalog 1990-1991, PCR Inc., Gainesville, FL, 1990, 1. [all data]
Paul and Kebarle, 1991
Paul, G.J.C.; Kebarle, P.,
Stabilities of Complexes of Br- with Substituted Benzenes (SB) Based on Determinations of the Gas-Phase Equilibria Br- + SB = (BrSB)-,
J. Am. Chem. Soc., 1991, 113, 4, 1148, https://doi.org/10.1021/ja00004a014
. [all data]
Chowdhury, Kishi, et al., 1989
Chowdhury, S.; Kishi, H.; Dillow, G.W.; Kebarle, P.,
Electron Affinities of Substituted Nitrobenzenes,
Can. J. Chem., 1989, 67, 4, 603, https://doi.org/10.1139/v89-091
. [all data]
Huh, Kang, et al., 1999
Huh, C.; Kang, C.H.; Lee, H.W.; Nakamura, H.; Mishima, M.; Tsuno, Y.; Yamataka, H.,
Thermodynamic stabilities and resonance demand of aromatic radical anions in the gas phase,
Bull. Chem. Soc. Japan, 1999, 72, 5, 1083-1091, https://doi.org/10.1246/bcsj.72.1083
. [all data]