2,2,4-trimethyl-3-hexanone
- Formula: C9H18O
- Molecular weight: 142.2386
- IUPAC Standard InChIKey: BUOFKUBCLQLWBP-UHFFFAOYSA-N
- CAS Registry Number: 40239-61-0
- Chemical structure:
View 3d structure (requires JavaScript / HTML 5) - Permanent link for this species. Use this link for bookmarking this species for future reference.

Phase change data

Data compiled by: Thermodynamics Research Center, NIST Boulder Laboratories, Chris Muzny director
Quantity | Value | Units | Method | Reference | Comment |
---|---|---|---|---|---|
Tboil | 431. | K | N/A | Nazarov, 1936 | Uncertainty assigned by TRC = 6. K |
Tboil | 429. | K | N/A | Haller and Bauer, 1913 | Uncertainty assigned by TRC = 4. K |

References

Nazarov, 1936
Nazarov, I.N.,
Chem. Ber., 1936, 69, 21. [all data]
Haller and Bauer, 1913
Haller, A.; Bauer, E.,
Ann. Chim. (Paris), 1913, 29, 8, 313. [all data]