4,6-dimethyl-3-heptanone
- Formula: C9H18O
- Molecular weight: 142.2386
- IUPAC Standard InChIKey: MZTSMUNNNLVGKC-UHFFFAOYSA-N
- CAS Registry Number: 40239-30-3
- Chemical structure:
View 3d structure (requires JavaScript / HTML 5) - Permanent link for this species. Use this link for bookmarking this species for future reference.

Phase change data

Data compiled by: Thermodynamics Research Center, NIST Boulder Laboratories, Chris Muzny director
Quantity | Value | Units | Method | Reference | Comment |
---|---|---|---|---|---|
Tboil | 445. | K | N/A | Powell and Hagemann, 1944 | Uncertainty assigned by TRC = 5. K |

References

Powell and Hagemann, 1944
Powell, S.G.; Hagemann, F.,
The Condensation of Isobutyraldehyde with Aliphatic Ketones,
J. Am. Chem. Soc., 1944, 66, 372. [all data]