4,5-dimethyl-2-hexanone
- Formula: C8H16O
- Molecular weight: 128.2120
- IUPAC Standard InChIKey: SNHWHSSUBMGTOS-UHFFFAOYSA-N
- CAS Registry Number: 40239-02-9
- Chemical structure:
View 3d structure (requires JavaScript / HTML 5) - Permanent link for this species. Use this link for bookmarking this species for future reference.

Phase change data

Data compiled by: Thermodynamics Research Center, NIST Boulder Laboratories, Chris Muzny director
Quantity | Value | Units | Method | Reference | Comment |
---|---|---|---|---|---|
Tboil | 439. | K | N/A | Dreux, 1956 | Uncertainty assigned by TRC = 4. K |

References

Dreux, 1956
Dreux, J.,
Bull. Soc. Chim. Fr., 1956, 1956, 1777. [all data]