Cyclopropanecarboxylic acid chloride
- Formula: C4H5ClO
- Molecular weight: 104.535
- IUPAC Standard InChIKey: ZOOSILUVXHVRJE-UHFFFAOYSA-N
- CAS Registry Number: 4023-34-1
- Chemical structure:
View 3d structure (requires JavaScript / HTML 5) - Other names: Cyclopropane carbonyl chloride; Cyclopropylcarboxyl chloride

Phase change data

Data compiled by: Robert L. Brown and Stephen E. Stein
Quantity | Value | Units | Method | Reference | Comment |
---|---|---|---|---|---|
Tboil | 392.2 | K | N/A | Aldrich Chemical Company Inc., 1990 | |
Tboil | 388. to 392. | K | N/A | Frinton Laboratories Inc., 1986 |

References

Aldrich Chemical Company Inc., 1990
Aldrich Chemical Company Inc.,
Catalog Handbook of Fine Chemicals, Aldrich Chemical Company, Inc., Milwaukee WI, 1990, 1. [all data]
Frinton Laboratories Inc., 1986
Frinton Laboratories Inc.,
Catalog Number 11, Frinton Laboratories Inc., Vineland, NJ, 1986, 99. [all data]