3,5-Bis(trifluoromethyl)benzaldehyde
- Formula: C9H4F6O
- Molecular weight: 242.1179
- IUPAC Standard InChIKey: LDWLIXZSDPXYDR-UHFFFAOYSA-N
- CAS Registry Number: 401-95-6
- Chemical structure:
View 3d structure (requires JavaScript / HTML 5) - Other names: 3,5-di(Trifluoromethyl)benzaldehyde

Gas phase ion energetics data

Data compiled by: John E. Bartmess
Electron affinity determinations
EA (eV) | Method | Reference | Comment |
---|---|---|---|
1.232 ± 0.087 | IMRE | Mishima, Huh, et al., 1993 | ΔGea(343 K)=-29.0 kcal/mol. Reanchored to EA(PhNO2), Kebarle and Chowdhury, 1987. |
1.266 ± 0.087 | IMRE | Huh, Kang, et al., 1999 | ΔG(EA) 343K; anchored to ΔG value. Including anchor ΔS, EA is ca. 0.4 kcal/mol more bound. |

References

Mishima, Huh, et al., 1993
Mishima, M.; Huh, C.; Nakamura, H.; Fujio, M.; Tsuno, Y.,
Electron Affinities of Benzaldehydes. Substituent Effects on Stabilities of Aromatic Radical Anions.,
Tetrahed. Lett., 1993, 34, 26, 4223, https://doi.org/10.1016/S0040-4039(00)60533-6
. [all data]
Kebarle and Chowdhury, 1987
Kebarle, P.; Chowdhury, S.,
Electron affinities and electron transfer reactions,
Chem. Rev., 1987, 87, 513. [all data]
Huh, Kang, et al., 1999
Huh, C.; Kang, C.H.; Lee, H.W.; Nakamura, H.; Mishima, M.; Tsuno, Y.; Yamataka, H.,
Thermodynamic stabilities and resonance demand of aromatic radical anions in the gas phase,
Bull. Chem. Soc. Japan, 1999, 72, 5, 1083-1091, https://doi.org/10.1246/bcsj.72.1083
. [all data]