1,6-Octadiene, 2,7-dimethyl-
- Formula: C10H18
- Molecular weight: 138.2499
- IUPAC Standard InChIKey: FHCSXUVUZAASRT-UHFFFAOYSA-N
- CAS Registry Number: 40195-09-3
- Chemical structure:
View 3d structure (requires JavaScript / HTML 5) - Other names: 2,7-Dimethyl-2,7-octadiene; 2,7-Dimethyl-1,6-octadiene

Normal alkane RI, polar column, temperature ramp

Column type | Active phase | I | Reference | Comment |
---|---|---|---|---|
Capillary | DB-Wax | 1312. | Tu, Thanh, et al., 2002 | 60. m/0.25 mm/0.25 μm, N2, 2. K/min; Tstart: 70. C; Tend: 230. C |

References

Tu, Thanh, et al., 2002
Tu, N.T.M.; Thanh, L.X.; Une, A.; Ukeda, H.; Sawamura, M.,
Volatile constituents of Vietnamese pummelo, orange, tangerine and lime peel oils,
Flavour Fragr. J., 2002, 17, 3, 169-174, https://doi.org/10.1002/ffj.1076
. [all data]