1-Fluoro-3-(trifluoro-methyl)benzene
- Formula: C7H4F4
- Molecular weight: 164.1003
- IUPAC Standard InChIKey: GBOWGKOVMBDPJF-UHFFFAOYSA-N
- CAS Registry Number: 401-80-9
- Chemical structure:
View 3d structure (requires JavaScript / HTML 5) - Other names: m-Fluorobenzotrifluoride; 3-Fluorobenzotrifluoride; Benzene, 1-fluoro-3-(trifluoromethyl)-; m,α,α,α-Tetrafluorotoluene; Toluene, α,α,α-m-tetrafluoro-; Toluene, m,α,α,α-tetrafluoro-; Trifluoromethyl-3-fluorobenzene; 1-(Trifluoromethyl)-3-fluorobenzene; m,alpha,alpha,alpha-Tetrafluorotoluene; 3-Fluoro(trifluoromethyl)benzene; α,α,α,3-Tetrafluorotoluene; Benzene, 1-fluoromethyl-3-trifluoromethyl

Gas phase thermochemistry data

Data compiled by: Hussein Y. Afeefy, Joel F. Liebman, and Stephen E. Stein
Quantity | Value | Units | Method | Reference | Comment |
---|---|---|---|---|---|
ΔfH°gas | -792.2 ± 1.1 | kJ/mol | Ccr | Good, Douslin, et al., 1959 | Reanalyzed by Cox and Pilcher, 1970, Original value = -770.57 kJ/mol |

Condensed phase thermochemistry data

Data compiled by: Hussein Y. Afeefy, Joel F. Liebman, and Stephen E. Stein
Quantity | Value | Units | Method | Reference | Comment |
---|---|---|---|---|---|
ΔfH°liquid | -830.2 ± 1.1 | kJ/mol | Ccr | Good, Douslin, et al., 1959 | Reanalyzed by Cox and Pilcher, 1970, Original value = -808.52 kJ/mol |
Quantity | Value | Units | Method | Reference | Comment |
ΔcH°liquid | -3211.7 ± 0.59 | kJ/mol | Ccr | Good, Douslin, et al., 1959 |

Phase change data

Data compiled as indicated in comments:
BS - Robert L. Brown and Stephen E. Stein
ALS - Hussein Y. Afeefy, Joel F. Liebman, and Stephen E. Stein
AC - William E. Acree, Jr., James S. Chickos
Quantity | Value | Units | Method | Reference | Comment |
---|---|---|---|---|---|
Tboil | 373. | K | N/A | PCR Inc., 1990 | BS |
Tboil | 374.7 | K | N/A | Weast and Grasselli, 1989 | BS |
Quantity | Value | Units | Method | Reference | Comment |
ΔvapH° | 37.9 ± 0.2 | kJ/mol | V | Good, Douslin, et al., 1959 | ALS |
Enthalpy of vaporization
ΔvapH (kJ/mol) | Temperature (K) | Method | Reference | Comment |
---|---|---|---|---|
36.8 | 328. | A | Stephenson and Malanowski, 1987 | Based on data from 313. to 410. K. See also Dykyj and Vanko, 1970.; AC |
Antoine Equation Parameters
log10(P) = A − (B / (T + C))
P = vapor pressure (bar)
T = temperature (K)
View plot Requires a JavaScript / HTML 5 canvas capable browser.
Temperature (K) | A | B | C | Reference | Comment |
---|---|---|---|---|---|
313.60 to 410. | 4.13277 | 1305.633 | -57.392 | Good, Douslin, et al., 1959 | Coefficents calculated by NIST from author's data. |

Normal alkane RI, non-polar column, temperature ramp

Column type | Active phase | I | Reference | Comment |
---|---|---|---|---|
Capillary | OV-101 | 861. | Zenkevich, Eliseenkov, et al., 2006 | Nitrogen, 6. K/min, 240. C @ 10. min; Column length: 25. m; Column diameter: 0.20 mm; Tstart: 60. C |
Capillary | OV-101 | 861. | Zenkevich, Makarov, et al., 2005 | 25. m/0.25 mm/0.20 μm, Nitrogen, 60. C @ 0. min, 8. K/min, 240. C @ 0. min |

References

Good, Douslin, et al., 1959
Good, W.D.; Douslin, D.R.; Scott, D.W.; George, A.; Lacina, J.L.; Dawson, J.P.; Waddington, G.,
Thermochemistry and vapor pressure of aliphatic fluorocarbons. A comparison of the C-F and C-H thermochemical bond energies,
J. Phys. Chem., 1959, 63, 1133-1138. [all data]
Cox and Pilcher, 1970
Cox, J.D.; Pilcher, G.,
Thermochemistry of Organic and Organometallic Compounds, Academic Press, New York, 1970, 1-636. [all data]
PCR Inc., 1990
PCR Inc.,
Research Chemicals Catalog 1990-1991, PCR Inc., Gainesville, FL, 1990, 1. [all data]
Weast and Grasselli, 1989
CRC Handbook of Data on Organic Compounds, 2nd Editon, Weast,R.C and Grasselli, J.G., ed(s)., CRC Press, Inc., Boca Raton, FL, 1989, 1. [all data]
Stephenson and Malanowski, 1987
Stephenson, Richard M.; Malanowski, Stanislaw,
Handbook of the Thermodynamics of Organic Compounds, 1987, https://doi.org/10.1007/978-94-009-3173-2
. [all data]
Dykyj and Vanko, 1970
Dykyj, J.; Vanko, A.,
Petrochemica, 1970, 10, 1, 3. [all data]
Zenkevich, Eliseenkov, et al., 2006
Zenkevich, I.G.; Eliseenkov, E.V.; Kasatochkin, A.N.,
Application of Retention Indices in GC-MS Identification of Halogenated Organic Compounds,
Mass Spectromery (Rus.), 2006, 3, 2, 131-140. [all data]
Zenkevich, Makarov, et al., 2005
Zenkevich, I.G.; Makarov, A.A.; Eliseenkov, E.V.,
The XXIX Symposium Chromatographic Methods of Investigating the Organic Compounds. Book of Abstracts, Retention indices of some fluorinated arenes C7-C9 on polar inorganic sorbents. Unusual behavior of Silipor 600, Institute of Chemistry, Silesian University, Katowice, Poland, 2005, 43. [all data]