1-methyl-3-(trifluoromethyl)benzene
- Formula: C8H7F3
- Molecular weight: 160.1364
- CAS Registry Number: 401-79-6

Phase change data

Data compiled by: Thermodynamics Research Center, NIST Boulder Laboratories, Chris Muzny director
Quantity | Value | Units | Method | Reference | Comment |
---|---|---|---|---|---|
Tboil | 400. | K | N/A | Simons and Ramler, 1943 | Uncertainty assigned by TRC = 5. K |

Reaction thermochemistry data

Data compiled by: John E. Bartmess
Individual Reactions
C8H6F3- + = C8H7F3
By formula: C8H6F3- + H+ = C8H7F3
Quantity | Value | Units | Method | Reference | Comment |
---|---|---|---|---|---|
ΔrH° | 1544. ± 8.8 | kJ/mol | G+TS | Caldwell and Bartmess | gas phase; value altered from reference due to change in acidity scale |
Quantity | Value | Units | Method | Reference | Comment |
ΔrG° | 1515. ± 8.4 | kJ/mol | IMRE | Caldwell and Bartmess | gas phase; value altered from reference due to change in acidity scale |

Gas phase ion energetics data

Data compiled by: John E. Bartmess
De-protonation reactions
C8H6F3- + = C8H7F3
By formula: C8H6F3- + H+ = C8H7F3
Quantity | Value | Units | Method | Reference | Comment |
---|---|---|---|---|---|
ΔrH° | 1544. ± 8.8 | kJ/mol | G+TS | Caldwell and Bartmess | gas phase; value altered from reference due to change in acidity scale |
Quantity | Value | Units | Method | Reference | Comment |
ΔrG° | 1515. ± 8.4 | kJ/mol | IMRE | Caldwell and Bartmess | gas phase; value altered from reference due to change in acidity scale |

References

Simons and Ramler, 1943
Simons, J.H.; Ramler, E.O.,
Preparation and Properties of SOme New Trifluoromethyl Compounds,
J. Am. Chem. Soc., 1943, 65, 389. [all data]
Caldwell and Bartmess
Caldwell, G.; Bartmess, J.E.,
, Unpublished results. [all data]