Oxirane, (ethoxymethyl)-
- Formula: C5H10O2
- Molecular weight: 102.1317
- IUPAC Standard InChIKey: HQCSZRIVJVOYSU-UHFFFAOYSA-N
- CAS Registry Number: 4016-11-9
- Chemical structure:
View 3d structure (requires JavaScript / HTML 5) - Other names: Ethyl glycidyl ether; Propane, 1,2-epoxy-3-ethoxy-; (Ethoxymethyl)oxirane; 1,2-Epoxy-3-ethoxypropane; 3-Ethoxy-1,2-epoxypropane; 1,2-Epoxy-3-ethyloxy propane; UN 2752; NSC 71436; Oxirane, 2-(ethoxymethyl)-

Condensed phase thermochemistry data

Data compiled by: Hussein Y. Afeefy, Joel F. Liebman, and Stephen E. Stein
Quantity | Value | Units | Method | Reference | Comment |
---|---|---|---|---|---|
ΔfH°liquid | -295.3 ± 2.1 | kJ/mol | Ccb | Zaikin, Van Chin Syan, et al., 1972 |

Normal alkane RI, non-polar column, temperature ramp

Column type | Active phase | I | Reference | Comment |
---|---|---|---|---|
Capillary | OV-101 | 770. | Zenkevich, 2005 | 25. m/0.20 mm/0.10 μm, N2/He, 6. K/min; Tstart: 50. C; Tend: 250. C |

References

Zaikin, Van Chin Syan, et al., 1972
Zaikin, I.D.; Van Chin Syan, Yu.Ya.; Chuchmarev, S.K.; Elagin, G.I.,
Standard heats of formation of alkyl glycidyl ethers,
Russ. J. Phys. Chem. (Engl. Transl.), 1972, 46, 1238. [all data]
Zenkevich, 2005
Zenkevich, I.G.,
Experimentally measured retention indices., 2005. [all data]