Methyl isopropyl disulphide
- Formula: C4H10S2
- Molecular weight: 122.252
- IUPAC Standard InChIKey: MRCFHOIQEFOJEC-UHFFFAOYSA-N
- CAS Registry Number: 40136-65-0
- Chemical structure:
View 3d structure (requires JavaScript / HTML 5) - Other names: Disulfide, methyl 1-methylethyl; Methyl i-propyl disulfide; Methyl isopropyl disulfide; 2-Methyl-3,4-dithiapentane; Isopropyl methyl disulfide; Disulfide, isopropyl methyl; isopropyl methyl disulphide

Gas phase thermochemistry data

Data compiled by: Hussein Y. Afeefy, Joel F. Liebman, and Stephen E. Stein
Quantity | Value | Units | Method | Reference | Comment |
---|---|---|---|---|---|
ΔfH°gas | -79.1 | kJ/mol | Ion | Hawari, Griller, et al., 1986 |

Kovats' RI, non-polar column, isothermal

Column type | Active phase | Temperature (C) | I | Reference | Comment |
---|---|---|---|---|---|
Packed | Apiezon M | 130. | 906. | Garbuzov, Misharina, et al., 1985 | He or N2, Chromosorb W, AW-DMCS; Column length: 2.1 m |

Normal alkane RI, non-polar column, custom temperature program

Column type | Active phase | I | Reference | Comment |
---|---|---|---|---|
Capillary | Apieson M | 906. | Gao, Wang, et al., 2003 | Program: not specified |
Capillary | SE-52 | 899. | van Langenhove and Schamp, 1986 | Column length: 100. m; Column diameter: 0.50 mm; Program: not specified |

Normal alkane RI, polar column, temperature ramp

Column type | Active phase | I | Reference | Comment |
---|---|---|---|---|
Capillary | TC-Wax | 1192. | Ishizaki, Tachihara, et al., 2005 | 60. m/0.25 mm/0.25 μm, N2, 3. K/min, 220. C @ 40. min; Tstart: 70. C |

Normal alkane RI, polar column, custom temperature program

Column type | Active phase | I | Reference | Comment |
---|---|---|---|---|
Capillary | TC-Wax | 1192. | Kraft and Switt, 2005 | Program: not specified |
Capillary | TC-Wax | 1192. | Tachihara, Ishizaki, et al., 2004 | Program: not specified |
Capillary | PEG-1000 | 1221. | Gao, Wang, et al., 2003 | Program: not specified |

References

Hawari, Griller, et al., 1986
Hawari, J.A.; Griller, D.; Lossing, F.P.,
Thermochemistry of perthiyl radicals,
J. Am. Chem. Soc., 1986, 108, 3273-3275. [all data]
Garbuzov, Misharina, et al., 1985
Garbuzov, V.G.; Misharina, T.A.; Aerov, A.F.; Golovnya, R.V.,
Gas chromatographic retention indices for sulphur(II)-containing organic substances,
J. Anal. Chem. USSR (Engl. Transl.), 1985, 40, 4, 576-586. [all data]
Gao, Wang, et al., 2003
Gao, Y.; Wang, Y.; Yao, X.; Zhang, X.; Liu, M.; Hu, Z.; Fan, B.,
The prediction for gas chromatographic retention index of disulfides on stationary phases of different polarity,
Talanta, 2003, 59, 2, 229-237, https://doi.org/10.1016/S0039-9140(02)00500-3
. [all data]
van Langenhove and Schamp, 1986
van Langenhove, H.; Schamp, N.,
Identification of Volatiles in the Head Space of Acid-Treated Phosphate Rock by Gas Chromatography-Mass Spectromety,
J. Chromatogr., 1986, 351, 65-75, https://doi.org/10.1016/S0021-9673(01)83473-7
. [all data]
Ishizaki, Tachihara, et al., 2005
Ishizaki, S.; Tachihara, T.; Tamura, H.; Yanai, T.; Kitahara, T.,
Evaluation of odour-active compounds in roasted shrimp (Sergia lucens Hansen) by aroma extract dilution analysis,
Flavour Fragr. J., 2005, 20, 6, 562-566, https://doi.org/10.1002/ffj.1484
. [all data]
Kraft and Switt, 2005
Kraft, P.; Switt, K.A.D. (Eds),
Perspectives in Flavor and Fragrance Research, Wiley-VCH, Weinheim, Germany, 2005, 251. [all data]
Tachihara, Ishizaki, et al., 2004
Tachihara, T.; Ishizaki, S.; Ishikawa, M.; Kitahara, T.,
Studies on the volatile compounds of roasted spotted shrimp,
Chemistry Biodiversity, 2004, 1, 12, 2024-2033, https://doi.org/10.1002/cbdv.200490155
. [all data]