Bicyclo[2.2.0]hexane, 2,3-bis(methylene)-
- Formula: C8H10
- Molecular weight: 106.1650
- IUPAC Standard InChIKey: BWABVUBNQYHTFR-UHFFFAOYSA-N
- CAS Registry Number: 40117-13-3
- Chemical structure:
View 3d structure (requires JavaScript / HTML 5) - Permanent link for this species. Use this link for bookmarking this species for future reference.

Gas phase thermochemistry data

Data compiled by: Hussein Y. Afeefy, Joel F. Liebman, and Stephen E. Stein
Quantity | Value | Units | Method | Reference | Comment |
---|---|---|---|---|---|
ΔfH°gas | 315. | kJ/mol | Chyd | Roth, Scholz, et al., 1982 |

Condensed phase thermochemistry data

Data compiled by: Hussein Y. Afeefy, Joel F. Liebman, and Stephen E. Stein
Quantity | Value | Units | Method | Reference | Comment |
---|---|---|---|---|---|
ΔfH°liquid | 276. | kJ/mol | Chyd | Roth, Scholz, et al., 1982 |

Phase change data

Data compiled by: Donald R. Burgess, Jr.
Quantity | Value | Units | Method | Reference | Comment |
---|---|---|---|---|---|
ΔvapH° | 39.0 | kJ/mol | N/A | Roth, Scholz, et al., 1982 |

Reaction thermochemistry data

Data compiled by: Hussein Y. Afeefy, Joel F. Liebman, and Stephen E. Stein
Individual Reactions
By formula: 3H2 + C8H10 = C8H16
Quantity | Value | Units | Method | Reference | Comment |
---|---|---|---|---|---|
ΔrH° | -488.7 | kJ/mol | Chyd | Roth, Scholz, et al., 1982 | liquid phase |

References

Roth, Scholz, et al., 1982
Roth, W.R.; Scholz, B.P.; Breuckmann, R.; Jelich, K.; Lennartz, H.W.,
Thermolysis of 1,2,6,7-octatetraene,
Chem. Ber., 1982, 115, 1934-1946. [all data]