Bicyclo[4.2.0]octa-2,4,7-triene
- Formula: C8H8
- Molecular weight: 104.1491
- IUPAC Standard InChIKey: ODPJJUMAGHWOOY-UHFFFAOYSA-N
- CAS Registry Number: 4011-16-9
- Chemical structure:
View 3d structure (requires JavaScript / HTML 5) - Permanent link for this species. Use this link for bookmarking this species for future reference.

Reaction thermochemistry data

Data compiled by: Hussein Y. Afeefy, Joel F. Liebman, and Stephen E. Stein
Individual Reactions
By formula: C8H8 = c8H8
Quantity | Value | Units | Method | Reference | Comment |
---|---|---|---|---|---|
ΔrH° | 23. ± 3. | kJ/mol | Eqk | Squillacote and Bergman, 1986 | gas phase |

References

Squillacote and Bergman, 1986
Squillacote, M.E.; Bergman, A.,
Trapping of 1,3,5,7-cyclooctatetraene valence tautomers. Thermodynamic stability of bicyclo[4.2.0]octa-2,4,7-triene,
J. Org. Chem., 1986, 51, 3910-3911. [all data]