Etizolam
- Formula: C17H15ClN4S
- Molecular weight: 342.846
- IUPAC Standard InChIKey: VMZUTJCNQWMAGF-UHFFFAOYSA-N
- CAS Registry Number: 40054-69-1
- Chemical structure:
View 3d structure (requires JavaScript / HTML 5) - Other names: 4H-s-Triazolo(3,4-c)thieno(2,3-e)(1,4)-diazepine, 6-(o-chlorophenyl)-8-ethyl-1-methyl-; AHR 3219; 6-(o-Chlorophenyl)-8-ethyl-1-methyl-4H-s-triazolo(3,4-c)thieno(2,3-e)(1,4)-diazepine; 6-(o-Chlorphenyl)-8-aethyl-1-methyl-4H-s-triazolo(3,4-c)thieno(2,3-e)(1,4)diazepin; 6H-Thieno(3,2-f)(1,2,4)triazolo(4,3-a)(1,4)diazepine, 4-(2-chlorophenyl)-2-ethyl-9-methyl-; Y-7131; 4-(o-Chlorophenyl)-2-ethyl-9-methyl-6H-thieno[3,2-f]-s-triazolo[4,3-a][1,4]diazepine; Depas

Kovats' RI, non-polar column, custom temperature program

Column type | Active phase | I | Reference | Comment |
---|---|---|---|---|
Capillary | OV-1 | 3090. | Schütz, 1988 | Program: not specified |

References

Schütz, 1988
Schütz, H.,
Modern screening strategies in analytical toxicology with special regard to new benzodiazepines,
Z. Rechtsmed., 1988, 100, 1, 19-37, https://doi.org/10.1007/BF00200362
. [all data]