Acetic acid, trifluoro-, 1,1-dimethylethyl ester
- Formula: C6H9F3O2
- Molecular weight: 170.1297
- IUPAC Standard InChIKey: UQJLSMYQBOJUGG-UHFFFAOYSA-N
- CAS Registry Number: 400-52-2
- Chemical structure:
View 3d structure (requires JavaScript / HTML 5) - Other names: Acetic acid, trifluoro-, tert-butyl ester; tert-Butyl trifluoroacetate

Gas phase thermochemistry data

Data compiled by: Hussein Y. Afeefy, Joel F. Liebman, and Stephen E. Stein
Quantity | Value | Units | Method | Reference | Comment |
---|---|---|---|---|---|
ΔfH°gas | -1098.3 ± 6.3 | kJ/mol | Cm | Guthrie, 1977 | Hydrolysis |

Condensed phase thermochemistry data

Data compiled by: Hussein Y. Afeefy, Joel F. Liebman, and Stephen E. Stein
Quantity | Value | Units | Method | Reference | Comment |
---|---|---|---|---|---|
ΔfH°liquid | -1135.0 ± 4.8 | kJ/mol | Cm | Guthrie, 1977 | Hydrolysis |

Phase change data

Data compiled as indicated in comments:
BS - Robert L. Brown and Stephen E. Stein
ALS - Hussein Y. Afeefy, Joel F. Liebman, and Stephen E. Stein
Quantity | Value | Units | Method | Reference | Comment |
---|---|---|---|---|---|
Tboil | 356.2 | K | N/A | Weast and Grasselli, 1989 | BS |
Quantity | Value | Units | Method | Reference | Comment |
ΔvapH° | 36.7 ± 4.2 | kJ/mol | C | Guthrie, 1977 | Hydrolysis; ALS |

References

Guthrie, 1977
Guthrie, J.P.,
Cyclization of glycol monoesters to give hemiorthoesters: a test of the thermochemical method for determining free energies of tetrahedral intermediates,
Can. J. Chem., 1977, 55, 3562-3574. [all data]
Weast and Grasselli, 1989
CRC Handbook of Data on Organic Compounds, 2nd Editon, Weast,R.C and Grasselli, J.G., ed(s)., CRC Press, Inc., Boca Raton, FL, 1989, 1. [all data]