2,4-Dimethyl-2-oxazoline-4-methanol
- Formula: C6H11NO2
- Molecular weight: 129.1570
- IUPAC Standard InChIKey: YWLSGHOSSUXBJK-UHFFFAOYSA-N
- CAS Registry Number: 39986-37-3
- Chemical structure:
View 3d structure (requires JavaScript / HTML 5) - Other names: 2,4-Dimethyl-4-hydroxymethyl-2-oxazoline; 4-Oxazolemethanol, 4,5-dihydro-2,4-dimethyl-

Phase change data

Data compiled by: Robert L. Brown and Stephen E. Stein
Reduced pressure boiling point
Tboil (K) | Pressure (bar) | Reference |
---|---|---|
377. to 379. | 0.020 | Frinton Laboratories Inc., 1986 |

References

Frinton Laboratories Inc., 1986
Frinton Laboratories Inc.,
Catalog Number 11, Frinton Laboratories Inc., Vineland, NJ, 1986, 99. [all data]