p-Bromophenyl butyl ether
- Formula: C10H13BrO
- Molecular weight: 229.114
- IUPAC Standard InChIKey: BOUVKHWPQNEXTO-UHFFFAOYSA-N
- CAS Registry Number: 39969-57-8
- Chemical structure:
View 3d structure (requires JavaScript / HTML 5) - Permanent link for this species. Use this link for bookmarking this species for future reference.

Phase change data

Data compiled by: Robert L. Brown and Stephen E. Stein
Reduced pressure boiling point
Tboil (K) | Pressure (bar) | Reference |
---|---|---|
418. to 421. | 0.067 | Frinton Laboratories Inc., 1986 |

References

Frinton Laboratories Inc., 1986
Frinton Laboratories Inc.,
Catalog Number 11, Frinton Laboratories Inc., Vineland, NJ, 1986, 99. [all data]