methyl epijasmonate
- Formula: C13H20O3
- Molecular weight: 224.2961
- IUPAC Standard InChIKey: GEWDNTWNSAZUDX-ZJRFNNFUSA-N
- CAS Registry Number: 39924-52-2
- Chemical structure:
View 3d structure (requires JavaScript / HTML 5) - Stereoisomers:
- Methyl jasmonate
- Cyclopentaneacetic acid, 3-oxo-2-(2-pentenyl)-, methyl ester, [1α,2α(Z)]-
- (+)-Jasmonic acid, methyl ester (cis)
- (-)-Jasmonic acid, methyl ester (trans)
- (+)-(Z)-Methyl epijasmonate
- Methyl (Z)-epi-jasmonate
- cis-Methyl jasmonate
- (E)-methyl jasmonate
- Methyl epi-jasmonate
- (Z)-Methyl epi-jasmonate
- Other names: methyl 3-oxo-2-(pent-2-enyl)cyclopentaneacetate

Van Den Dool and Kratz RI, non-polar column, temperature ramp

Column type | Active phase | I | Reference | Comment |
---|---|---|---|---|
Capillary | HP-5MS | 1614. | Garland, Menary, et al., 2004 | 30. m/0.22 mm/0.25 μm, N2, 60. C @ 1. min, 20. K/min, 290. C @ 10. min |

Normal alkane RI, polar column, temperature ramp

Column type | Active phase | I | Reference | Comment |
---|---|---|---|---|
Capillary | DB-Wax | 2349. | Ito, Sugimoto, et al., 2002 | 60. C @ 4. min, 3. K/min; Column length: 60. m; Column diameter: 0.25 mm; Tend: 180. C |
Capillary | PEG-20M | 2253. | Togari, Kobayashi, et al., 1995 | 50. m/0.25 mm/0.15 μm, He, 60. C @ 4. min, 2. K/min; Tend: 180. C |

References

Garland, Menary, et al., 2004
Garland, S.M.; Menary, R.C.; Davies, N.W.; Oliver, G.S.,
Practical approaches to the analyses for pesticide residues in essential oils, A report for the Rural Industries Research and Development Corporation, RIRDC Publication No. 04/109, Rural Industries Research and Development Corporation, Barton, ACT, 2004. [all data]
Ito, Sugimoto, et al., 2002
Ito, Y.; Sugimoto, A.; Kakuda, T.; Kubota, K.,
Identification of potent odorants in Chinese jasmine green tea scented with flowers of Jasminum sambac,
J. Agric. Food Chem., 2002, 50, 17, 4878-4884, https://doi.org/10.1021/jf020282h
. [all data]
Togari, Kobayashi, et al., 1995
Togari, N.; Kobayashi, A.; Aishima, T.,
Pattern recognition applied to gas chromatographic profiles of volatile components in three tea categories,
Food Res. Int., 1995, 28, 5, 495-502, https://doi.org/10.1016/0963-9969(95)00029-1
. [all data]