Benzenamine, 4-(hexyloxy)-
- Formula: C12H19NO
- Molecular weight: 193.2854
- IUPAC Standard InChIKey: DJRKHTCUXRGYEU-UHFFFAOYSA-N
- CAS Registry Number: 39905-57-2
- Chemical structure:
View 3d structure (requires JavaScript / HTML 5) - Other names: 4-Hexyloxyaniline; p-Hexyloxyaniline; 4-n-Hexyloxyaniline; Aniline, (p-hexyloxy)-

Phase change data

Data compiled by: Robert L. Brown and Stephen E. Stein
Reduced pressure boiling point
Tboil (K) | Pressure (bar) | Reference |
---|---|---|
429.7 | 0.007 | Aldrich Chemical Company Inc., 1990 |
440. to 442. | 0.007 | Frinton Laboratories Inc., 1986 |

References

Aldrich Chemical Company Inc., 1990
Aldrich Chemical Company Inc.,
Catalog Handbook of Fine Chemicals, Aldrich Chemical Company, Inc., Milwaukee WI, 1990, 1. [all data]
Frinton Laboratories Inc., 1986
Frinton Laboratories Inc.,
Catalog Number 11, Frinton Laboratories Inc., Vineland, NJ, 1986, 99. [all data]