4-Pentyloxyaniline
- Formula: C11H17NO
- Molecular weight: 179.2588
- IUPAC Standard InChIKey: QZLNSNIHXKQIIS-UHFFFAOYSA-N
- CAS Registry Number: 39905-50-5
- Chemical structure:
View 3d structure (requires JavaScript / HTML 5) - Other names: p-Pentyloxyaniline; Benzenamine, 4-(pentyloxy)-

Phase change data

Data compiled by: Robert L. Brown and Stephen E. Stein
Reduced pressure boiling point
Tboil (K) | Pressure (bar) | Reference |
---|---|---|
455. to 456. | 0.027 | Frinton Laboratories Inc., 1986 |

References

Frinton Laboratories Inc., 1986
Frinton Laboratories Inc.,
Catalog Number 11, Frinton Laboratories Inc., Vineland, NJ, 1986, 99. [all data]