Benzenamine, 4-(octyloxy)-
- Formula: C14H23NO
- Molecular weight: 221.3385
- IUPAC Standard InChIKey: ACYGZCHBIGKPGR-UHFFFAOYSA-N
- CAS Registry Number: 39905-45-8
- Chemical structure:
View 3d structure (requires JavaScript / HTML 5) - Other names: 4-(Octyloxy)aniline; p-Octyloxyaniline

Phase change data

Data compiled by: Robert L. Brown and Stephen E. Stein
Reduced pressure boiling point
Tboil (K) | Pressure (bar) | Reference |
---|---|---|
418. to 421. | 0.0007 | Frinton Laboratories Inc., 1986 |

References

Frinton Laboratories Inc., 1986
Frinton Laboratories Inc.,
Catalog Number 11, Frinton Laboratories Inc., Vineland, NJ, 1986, 99. [all data]