7,7-Dimethyoxynorborane

Reaction thermochemistry data

Data compiled by: Hussein Y. Afeefy, Joel F. Liebman, and Stephen E. Stein

Individual Reactions

C9H16O2 + Water = Norbornadieone + 2Methyl Alcohol

By formula: C9H16O2 + H2O = C7H10O + 2CH4O

Quantity Value Units Method Reference Comment
Δr45. ± 2.kJ/molCmWiberg, Morgan, et al., 1994liquid phase

Norbornadieone + 2Methyl Alcohol = C9H16O2 + Water

By formula: C7H10O + 2CH4O = C9H16O2 + H2O

Quantity Value Units Method Reference Comment
Δr-69. ± 3.kJ/molCmWiberg, Morgan, et al., 1994gas phase

References

Wiberg, Morgan, et al., 1994
Wiberg, K.B.; Morgan, K.M.; Maltz, H., Thermochemistry of carbonyl reactions. 6. A study of hydration equilibria, J. Am. Chem. Soc., 1994, 116, 11067-11077. [all data]