Cyclohexene, 3-(1-methylethyl)-
- Formula: C9H16
- Molecular weight: 124.2233
- IUPAC Standard InChIKey: HKZXDFQIKRFLMW-UHFFFAOYSA-N
- CAS Registry Number: 3983-08-2
- Chemical structure:
View 3d structure (requires JavaScript / HTML 5) - Other names: 3-isopropylcyclohexene; 3-Isopropylcyclohexene-1

Kovats' RI, non-polar column, isothermal

Column type | Active phase | Temperature (C) | I | Reference | Comment |
---|---|---|---|---|---|
Capillary | SE-30 | 80. | 926.5 | Albaigés and Guardino, 1980 | He; Column length: 64. m; Column diameter: 0.25 mm |
Capillary | Squalane | 80. | 926.1 | Albaigés and Guardino, 1980 | He; Column length: 100. m; Column diameter: 0.25 mm |
Packed | Squalane | 80. | 921. | Bogoslovsky, Anvaer, et al., 1978 | |
Capillary | Squalane | 100. | 924. | Rang, Orav, et al., 1977 | Nitrogen or helium; Column length: 100. m; Column diameter: 0.25 mm |
Capillary | Apiezon L | 100. | 948. | Eisen, Orav, et al., 1972 | Column length: 45. m; Column diameter: 0.25 mm |
Capillary | Apiezon L | 120. | 956. | Eisen, Orav, et al., 1972 | Column length: 45. m; Column diameter: 0.25 mm |
Capillary | Squalane | 60. | 915.9 | Eisen, Orav, et al., 1972 | Column length: 80. m; Column diameter: 0.25 mm |
Capillary | Squalane | 80. | 921.0 | Eisen, Orav, et al., 1972 | Column length: 80. m; Column diameter: 0.25 mm |

Kovats' RI, polar column, isothermal

Column type | Active phase | Temperature (C) | I | Reference | Comment |
---|---|---|---|---|---|
Capillary | PEG-20M | 80. | 1049. | Rang, Orav, et al., 1988 | |
Capillary | PEG 4000 | 100. | 1081. | Rang, Orav, et al., 1988 | |
Capillary | PEG 4000 | 110. | 1093. | Rang, Orav, et al., 1988 | |
Capillary | PEG 4000 | 80. | 1070. | Rang, Orav, et al., 1988 | |
Capillary | PEG 4000 | 100. | 1081. | Rang, Orav, et al., 1977 | Nitrogen or Helium; Column length: 45. m; Column diameter: 0.25 mm |
Capillary | Polyethylene Glycol 4000 | 100. | 1062.8 | Eisen, Orav, et al., 1972 | Column length: 80. m; Column diameter: 0.25 mm |
Capillary | Polyethylene Glycol 4000 | 60. | 1043.8 | Eisen, Orav, et al., 1972 | Column length: 80. m; Column diameter: 0.25 mm |
Capillary | Polyethylene Glycol 4000 | 80. | 1053.9 | Eisen, Orav, et al., 1972 | Column length: 80. m; Column diameter: 0.25 mm |

References

Albaigés and Guardino, 1980
Albaigés, J.; Guardino, X.,
Gas chromatographic-mass spectrometric identification of alkylcyclohexanes and cyclohexenes,
Chromatographia, 1980, 13, 12, 755-762, https://doi.org/10.1007/BF02265555
. [all data]
Bogoslovsky, Anvaer, et al., 1978
Bogoslovsky, Yu.N.; Anvaer, B.I.; Vigdergauz, M.S.,
Chromatographic constants in gas chromatography (in Russian), Standards Publ. House, Moscow, 1978, 192. [all data]
Rang, Orav, et al., 1977
Rang, S.; Orav, A.; Kuningas, K.; Eisen, O.,
Capillary Gas Chromatography of Monosubstituted Cyclopentenes and Cyclohexenes,
Chromatographia, 1977, 10, 3, 115-122, https://doi.org/10.1007/BF02297862
. [all data]
Eisen, Orav, et al., 1972
Eisen, O.; Orav, A.; Rang, S.,
Identifizierung von Normal-Alkenen, Cyclopentenen und -Hexenen mittels Kapillar-Gas-Chromatographie. Identification des alcènes, cyclopentènes et -hexènes à l'aide de la chromatogrpahie en phase gazeuse sur colonne capillaire,
Chromatographia, 1972, 5, 11, 229-239, https://doi.org/10.1007/BF02270600
. [all data]
Rang, Orav, et al., 1988
Rang, S.A.; Orav, A.E.; Kuningas, K.R.; Meister, A.E.; Strense, T.V.; Eisen, O.G.,
Gas-Chromatographic Characteristics of unsaturated hydrocarbons, Academy of Sciences of Estonia SSR, Tallinn, Estonia SSR, 1988, 208. [all data]