Thianaphthene-2-carbonyl chloride
- Formula: C9H5ClOS
- Molecular weight: 196.653
- IUPAC Standard InChIKey: DNGLRCHMGDDHNC-UHFFFAOYSA-N
- CAS Registry Number: 39827-11-7
- Chemical structure:
View 3d structure (requires JavaScript / HTML 5) - Other names: Benzo[b]thiophene-2-carbonyl chloride

Phase change data

Data compiled by: Robert L. Brown and Stephen E. Stein
Quantity | Value | Units | Method | Reference | Comment |
---|---|---|---|---|---|
Tfus | 361. to 362. | K | N/A | Buckingham and Donaghy, 1982 |
Reduced pressure boiling point
Tboil (K) | Pressure (bar) | Reference |
---|---|---|
446. to 448. | 0.025 | Buckingham and Donaghy, 1982 |

References

Buckingham and Donaghy, 1982
Buckingham, J.; Donaghy, S.M.,
Dictionary of Organic Compounds: Fifth Edition, Chapman and Hall, New York, 1982, 1. [all data]