Benzene, 1,3-dimethyl-5-propyl-
- Formula: C11H16
- Molecular weight: 148.2447
- IUPAC Standard InChIKey: NBICXWXPZRNMPF-UHFFFAOYSA-N
- CAS Registry Number: 3982-64-7
- Chemical structure:
View 3d structure (requires JavaScript / HTML 5) - Other names: 1,3-Dimethyl-5-propylbenzene; 1,3-Dimethyl-5-n-Propylbenzene

Phase change data

Data compiled by: Thermodynamics Research Center, NIST Boulder Laboratories, Chris Muzny director
Quantity | Value | Units | Method | Reference | Comment |
---|---|---|---|---|---|
Tboil | 475.39 | K | N/A | Anonymous, 1948 | Uncertainty assigned by TRC = 0.3 K |
Quantity | Value | Units | Method | Reference | Comment |
Tfus | 213.97 | K | N/A | Anonymous, 1948 | Uncertainty assigned by TRC = 0.25 K |

Kovats' RI, non-polar column, isothermal

Column type | Active phase | Temperature (C) | I | Reference | Comment |
---|---|---|---|---|---|
Capillary | OV-101 | 100. | 1133. | Matisová, Kovacicová, et al., 1989 | He; Column length: 50. m; Column diameter: 0.20 mm |
Capillary | OV-101 | 100. | 1133. | Matisová, Rukríglová, et al., 1988 | H2; Column length: 278. m; Column diameter: 0.25 mm |
Capillary | SE-30 | 70. | 1126.0 | Tóth, 1983 | N2; Column length: 15. m; Column diameter: 0.25 mm |

Kovats' RI, polar column, isothermal

Column type | Active phase | Temperature (C) | I | Reference | Comment |
---|---|---|---|---|---|
Capillary | PEG-20M | 70. | 1406.2 | Tóth, 1983 | N2; Column length: 30. m; Column diameter: 0.3 mm |
Capillary | Carbowax 20M | 90. | 1363.4 | Döring, Estel, et al., 1974 | Column length: 100. m; Column diameter: 0.2 mm |

Normal alkane RI, non-polar column, isothermal

Column type | Active phase | Temperature (C) | I | Reference | Comment |
---|---|---|---|---|---|
Capillary | Squalane | 140. | 1139. | Protic, Svob, et al., 1980 | He; Column length: 100. m; Column diameter: 0.25 mm |

Normal alkane RI, non-polar column, custom temperature program

Column type | Active phase | I | Reference | Comment |
---|---|---|---|---|
Capillary | Polymethylsiloxane, (PMS-20000) | 1126. | Cornwell and Cordano, 2003 | Program: not specified |
Capillary | SE-30 | 1124. | Xiuhua, Zhang, et al., 1996 | Program: not specified |
Capillary | SE-30 | 1126. | Xiuhua, Zhang, et al., 1996 | Program: not specified |
Capillary | SE-30 | 1127. | Xiuhua, Zhang, et al., 1996 | Program: not specified |
Capillary | OV-101 | 1132. | Matisová, Juranyiová, et al., 1991 | 52. m/0.25 mm/0.38 μm, H2; Program: 70 - 160 C at 1.5 deg/min; 160 - 280 C at 15 deg/min 15 min at 280 C |

Normal alkane RI, polar column, isothermal

Column type | Active phase | Temperature (C) | I | Reference | Comment |
---|---|---|---|---|---|
Capillary | Carbowax 20M | 90. | 1363. | Sutter, Peterson, et al., 1997 |

Normal alkane RI, polar column, custom temperature program

Column type | Active phase | I | Reference | Comment |
---|---|---|---|---|
Capillary | Carbowax 20M | 1406. | Cornwell and Cordano, 2003 | Program: not specified |
Capillary | Carbowax 20M | 1363. | Ivanciuc, Ivanciuc, et al., 2001 | Program: not specified |
Capillary | PEG-20M | 1408. | Xiuhua, Zhang, et al., 1996 | Program: not specified |

References

Anonymous, 1948
Anonymous, R.,
, Am. Pet. Inst. Res. Proj. 6, Natl. Bur. Stand., 1948. [all data]
Matisová, Kovacicová, et al., 1989
Matisová, E.; Kovacicová, E.; Ha, P.T.; Kolek, E.; Engewald, W.,
Identification of alkylbenzenes up to C12 by capillary gas chromatography-mass spectrometry. II. Retention indices on OV-101 columns and retention-molecular structure correlations,
J. Chromatogr., 1989, 475, 2, 113-123, https://doi.org/10.1016/S0021-9673(01)89667-9
. [all data]
Matisová, Rukríglová, et al., 1988
Matisová, E.; Rukríglová, M.; Krupcík, J.; Kovacicová, E.; Holotík, S.,
Identification of alkylbenzenes up to C12 by capillary gas chromatography and combined gas chromatography-mass spectrometry. I. OV-101 as stationary phase,
J. Chromatogr., 1988, 455, 301-309, https://doi.org/10.1016/S0021-9673(01)82129-4
. [all data]
Tóth, 1983
Tóth, T.,
Use of capillary gas chromatography in collecting retention and chemical information for the analysis of complex petrochemical mixtures,
J. Chromatogr., 1983, 279, 157-165, https://doi.org/10.1016/S0021-9673(01)93614-3
. [all data]
Döring, Estel, et al., 1974
Döring, C.E.; Estel, D.; Fischer, R.,
Kapillar-gaschromatographische Charakterisierung von C10-bis C12-Aromaten,
J. Prakt. Chem., 1974, 316, 1, 1-12, https://doi.org/10.1002/prac.19743160102
. [all data]
Protic, Svob, et al., 1980
Protic, G.; Svob, V.; Deur-Siftar, D.,
Mass spectrometric and gas chromatographic data in hydrocarbon analyse,
Sci. Papers of the Prague Institute of Chem. Technol., 1980, D42, 139-147. [all data]
Cornwell and Cordano, 2003
Cornwell, E.; Cordano, G.,
Nueva proposicion para predecir datos de retencion obtenidos mediante cromatografia de gases de hidrocarburos derivados de las naftas,
Revista de la Sociedad Quimica de Mexico, 2003, 47, 1, 38-43. [all data]
Xiuhua, Zhang, et al., 1996
Xiuhua, Zh.; Zhang, L.; Che, X.,
Prediction of the Kovats retention indexes of polysubstituted alkylbenzenes,
Chin. J. Chromatogr., 1996, 14, 4, 244-248. [all data]
Matisová, Juranyiová, et al., 1991
Matisová, E.; Juranyiová, E.; Kurán, P.; Brandsteterová, E.; Kocan, A.; Holotík, S.,
Analysis of multicomponent mixtures by high-resolution capillary gas chromatography and combined gas chromatography-mass spectrometry. I. Aromatics in a hydrocarbon matrix,
J. Chromatogr., 1991, 552, 301-312, https://doi.org/10.1016/S0021-9673(01)95946-1
. [all data]
Sutter, Peterson, et al., 1997
Sutter, J.M.; Peterson, T.A.; Jurs, P.C.,
Prediction of gas chromatographic retention indices of alkylbenzenes,
Anal. Chim. Acta., 1997, 342, 2-3, 113-122, https://doi.org/10.1016/S0003-2670(96)00578-8
. [all data]
Ivanciuc, Ivanciuc, et al., 2001
Ivanciuc, O.; Ivanciuc, T.; Klein, D.J.; Seitz, W.A.; Balaban, A.T.,
Quantitative structure-retention relationships for gas chromatographic retention indices of alkylbenzenes with molecular graph descriptors,
SAR QSAR Environ. Res., 2001, 11, 5-6, 419-452, https://doi.org/10.1080/10629360108035362
. [all data]