Thiourea-cyclooctane adduct

Phase change data

Data compiled by: Eugene S. Domalski and Elizabeth D. Hearing

Enthalpy of phase transition

ΔHtrs (kJ/mol) Temperature (K) Initial Phase Final Phase Reference Comment
2.110187.2crystaline, IVcrystaline, IIICope, Gannon, et al., 1972
21.414240.crystaline, IIIcrystaline, IICope, Gannon, et al., 1972
0.703265.crystaline, IIcrystaline, ICope, Gannon, et al., 1972

Entropy of phase transition

ΔStrs (J/mol*K) Temperature (K) Initial Phase Final Phase Reference Comment
11.26187.2crystaline, IVcrystaline, IIICope, Gannon, et al., 1972
94.41240.crystaline, IIIcrystaline, IICope, Gannon, et al., 1972
2.65265.crystaline, IIcrystaline, ICope, Gannon, et al., 1972

References

Cope, Gannon, et al., 1972
Cope, A.F.G.; Gannon, D.J.; Parsonage, N.G., Thermodynamic properties of thiourea + hydrocarbon adducts from 12 to 300K. The heat capacities and entropies of the adducts of c-C6H12, c-C7H14, c-C8H16, and (CH3)3C.C2H5, J. Chem. Thermodynam., 1972, 4, 829-842. [all data]