Poly-[N-terphthalyl-bis-(N'-phenyl-o-diphenylamine)]

Condensed phase thermochemistry data

Data compiled by: Eugene S. Domalski and Elizabeth D. Hearing

Quantity Value Units Method Reference Comment
solid,1 bar601.2J/mol*KN/AKaryakin, Rabinovich, et al., 1974

Constant pressure heat capacity of solid

Cp,solid (J/mol*K) Temperature (K) Reference Comment
612.1298.15Karyakin, Rabinovich, et al., 1974T = 50 to 500 K.

References

Karyakin, Rabinovich, et al., 1974
Karyakin, N.V.; Rabinovich, I.B.; Korshak, V.V.; Rusanov, A.L.; Tugushi, D.S.; Mochalov, A.N.; Sapozhnikov, V.N., Thermodynamics of synthesis of poly-[2,2'-(p-phenylene)-1,1'-diphenyl-5,5'-dibenzimidazole] by intramolecular cyclodehydration of poly-[N-terephthalyl-bis-(N'-phenyl-o-diphenylamine)], Vysokomol. Soedin., 1974, A16, 691-697. [all data]