Pyridine, 4-(1,1-dimethylethyl)-

Phase change data

Data compiled as indicated in comments:
BS - Robert L. Brown and Stephen E. Stein
TRC - Thermodynamics Research Center, NIST Boulder Laboratories, Chris Muzny director
AC - William E. Acree, Jr., James S. Chickos

Quantity Value Units Method Reference Comment
Tboil469.7KN/AWeast and Grasselli, 1989BS
Quantity Value Units Method Reference Comment
Tfus233.45KN/ABrown and Murphey, 1951Uncertainty assigned by TRC = 0.5 K; TRC
Quantity Value Units Method Reference Comment
Δvap54.4 ± 1.3kJ/molCFreitas, Acree, et al., 2008AC

In addition to the Thermodynamics Research Center (TRC) data available from this site, much more physical and chemical property data is available from the following TRC products:

References

Weast and Grasselli, 1989
CRC Handbook of Data on Organic Compounds, 2nd Editon, Weast,R.C and Grasselli, J.G., ed(s)., CRC Press, Inc., Boca Raton, FL, 1989, 1. [all data]

Brown and Murphey, 1951
Brown, H.C.; Murphey, W.A., A convenient synthesis of the monoalkylpyridines; a new prototropic reaction of 3-picoline, J. Am. Chem. Soc., 1951, 73, 3308. [all data]

Freitas, Acree, et al., 2008
Freitas, Vera L.S.; Acree, William E.; da Silva, Maria D.M.C. Ribeiro, Thermochemical Study of Three Hindered Pyridine Derivatives, J. Chem. Eng. Data, 2008, 53, 8, 1820-1823, https://doi.org/10.1021/je800155q . [all data]