Butane, 1-(ethenyloxy)-3-methyl-
- Formula: C7H14O
- Molecular weight: 114.1855
- IUPAC Standard InChIKey: QIUCYKBVFAPWRR-UHFFFAOYSA-N
- CAS Registry Number: 39782-38-2
- Chemical structure:
View 3d structure (requires JavaScript / HTML 5) - Other names: Vinylisopentyl ether

Condensed phase thermochemistry data

Data compiled by: Hussein Y. Afeefy, Joel F. Liebman, and Stephen E. Stein
Quantity | Value | Units | Method | Reference | Comment |
---|---|---|---|---|---|
ΔcH°liquid | -4490. ± 13. | kJ/mol | Ccb | Favorskii and Shostakovskii, 1943 | Corresponding ΔfHºliquid = -266. kJ/mol (simple calculation by NIST; no Washburn corrections) |

References

Favorskii and Shostakovskii, 1943
Favorskii, A.E.; Shostakovskii, M.F.,
Vinyl ethers. I. Synthesis and properties of vinyl ethers,
Zh. Obshch. Kim., 1943, 13, 1-20. [all data]