1,1'-Biphenyl, 2,6-dimethyl-
- Formula: C14H14
- Molecular weight: 182.2610
- IUPAC Standard InChIKey: BGXRAGCQZCSMOT-UHFFFAOYSA-N
- CAS Registry Number: 3976-34-9
- Chemical structure:
View 3d structure (requires JavaScript / HTML 5) - Permanent link for this species. Use this link for bookmarking this species for future reference.

Phase change data

Data compiled as indicated in comments:
BS - Robert L. Brown and Stephen E. Stein
TRC - Thermodynamics Research Center, NIST Boulder Laboratories, Chris Muzny director
Quantity | Value | Units | Method | Reference | Comment |
---|---|---|---|---|---|
Tboil | 535.7 | K | N/A | Weast and Grasselli, 1989 | BS |
Tboil | 536. | K | N/A | Jacobson, 1922 | Uncertainty assigned by TRC = 5. K; TRC |
Quantity | Value | Units | Method | Reference | Comment |
Tfus | 268. | K | N/A | Johnson, 1957 | Uncertainty assigned by TRC = 3. K; TRC |
Reduced pressure boiling point
Tboil (K) | Pressure (bar) | Reference | Comment |
---|---|---|---|
405.2 | 0.021 | Weast and Grasselli, 1989 | BS |

Kovats' RI, non-polar column, isothermal

View large format table.

Column type Active phase Temperature (C) I Reference Comment
PackedApiezon L170.1465.Kríz, Popl, et al., 1974
PackedApiezon L185.1477.Kríz, Popl, et al., 1974

Kovats' RI, polar column, isothermal

View large format table.

Column type Active phase Temperature (C) I Reference Comment
CapillarySP-1000185.1983.Kríz, Popl, et al., 1974N2; Column length: 50. m; Column diameter: 0.25 mm
CapillarySP-1000200.1948.Kríz, Popl, et al., 1974N2; Column length: 50. m; Column diameter: 0.25 mm

References

Weast and Grasselli, 1989
CRC Handbook of Data on Organic Compounds, 2nd Editon, Weast,R.C and Grasselli, J.G., ed(s)., CRC Press, Inc., Boca Raton, FL, 1989, 1. [all data]
Jacobson, 1922
Jacobson, P.,
Justus Liebigs Ann. Chem., 1922, 427, 142. [all data]
Johnson, 1957
Johnson, E.A.,
J. Chem. Soc., 1957, 1957, 4155. [all data]