2-Hexene, 5,5-dimethyl-, (Z)-
- Formula: C8H16
- Molecular weight: 112.2126
- IUPAC Standard InChIKey: NWZJLSKAFZXSQH-WAYWQWQTSA-N
- CAS Registry Number: 39761-61-0
- Chemical structure:
View 3d structure (requires JavaScript / HTML 5) - Stereoisomers:
- Other names: cis-5,5-Dimethyl-2-Hexene; 5,5-Dimethyl-2-hexene, (2Z)-; (2Z)-5,5-Dimethyl-2-hexene; cis-2-Hexene, 5,5-dimethyl; 5,5-Dimethyl-2-hexene (cis); (Z)-5,5-Dimethylhex-2-ene; 5,5-Dimethyl-2-hexene; 5,5-Dimethyl-cis-2-hexene

Kovats' RI, non-polar column, isothermal

Column type | Active phase | Temperature (C) | I | Reference | Comment |
---|---|---|---|---|---|
Capillary | Petrocol DH | 30. | 732.5 | Soják, Addová, et al., 2004 | 150. m/0.25 mm/1. μm, H2 |
Capillary | Squalane | 30. | 721.8 | Soják, Addová, et al., 2004 | He; Column length: 93. m; Column diameter: 0.25 mm |
Capillary | Squalane | 100. | 723. | Lulova, Leont'eva, et al., 1976 | He; Column length: 120. m; Column diameter: 0.25 mm |
Capillary | Squalane | 100. | 725. | Lulova, Leont'eva, et al., 1976 | He; Column length: 120. m; Column diameter: 0.25 mm |
Capillary | Squalane | 55. | 725. | Lulova, Leont'eva, et al., 1975 | He; Column length: 120. m; Column diameter: 0.25 mm |
Capillary | Squalane | 100. | 725. | Mitra, Mohan, et al., 1974 | H2; Column length: 50. m; Column diameter: 0.2 mm |
Capillary | Squalane | 40. | 724. | Matukuma, 1969 | N2; Column length: 91.4 m; Column diameter: 0.25 mm |
Packed | Squalane | 30. | 721.5 | Tourres, 1967 | H2; Column length: 10. m |
Packed | Squalane | 50. | 723.5 | Tourres, 1967 | H2; Column length: 10. m |

Normal alkane RI, non-polar column, custom temperature program

Column type | Active phase | I | Reference | Comment |
---|---|---|---|---|
Capillary | OV-1, SE-30, Methyl silicone, SP-2100, OV-101, DB-1, etc. | 709. | Waggott and Davies, 1984 | Hydrogen; Column length: 50. m; Column diameter: 0.32 mm; Program: not specified |

Normal alkane RI, polar column, custom temperature program

Column type | Active phase | I | Reference | Comment |
---|---|---|---|---|
Capillary | SOLGel-Wax | 757. | Johanningsmeier and McFeeters, 2011 | 30. m/0.25 mm/0.25 μm, Helium; Program: 40 0C (2 min) 5 0C/min -> 140 0C 10 0C/min -> 250 0C (3 min) |

Phase change data

Data compiled as indicated in comments:
TRC - Thermodynamics Research Center, NIST Boulder Laboratories, Chris Muzny director
AC - William E. Acree, Jr., James S. Chickos
Quantity | Value | Units | Method | Reference | Comment |
---|---|---|---|---|---|
Tboil | 380.1 | K | N/A | Whitmore, Whitmore, et al., 1950 | Uncertainty assigned by TRC = 0.5 K; TRC |
Quantity | Value | Units | Method | Reference | Comment |
ΔvapH° | 38.1 | kJ/mol | N/A | Reid, 1972 | AC |

References

Soják, Addová, et al., 2004
Soják, L.; Addová, G.; Kubinec, R.; Kraus, A.; Bohác, A.,
Capillary gas chromatography-mass spectrometry of all 93 acyclic octenes and their identification in fluid catalytic cracked gasoline,
J. Chromatogr. A, 2004, 1025, 2, 237-253, https://doi.org/10.1016/j.chroma.2003.10.112
. [all data]
Lulova, Leont'eva, et al., 1976
Lulova, N.I.; Leont'eva, S.A.; Timofeeva, A.N.,
Gas-chromatographic method of determination of individual hydrocarbons in catalytic cracking gasolines
in Proceedings of All-Union Research Institute on Oil Processes. Vol.18, All-Union Research Institute on Oil Processes, Moscow, 1976, 30-53. [all data]
Lulova, Leont'eva, et al., 1975
Lulova, N.I.; Leont'eva, S.A.; Fedosova, A.K.; Kvasova, V.A.,
Individual composition of hydrocarbons in naphthas from secondary processes,
Chem. Technol. Fuels Oils (Engl. Transl.), 1975, 11, 1/2, 59-64, https://doi.org/10.1007/BF00717315
. [all data]
Mitra, Mohan, et al., 1974
Mitra, G.D.; Mohan, G.; Sinha, A.,
Gas chromatographic analysis of complex hydrocarbon mixtures,
J. Chromatogr. A, 1974, 91, 633-648, https://doi.org/10.1016/S0021-9673(01)97944-0
. [all data]
Matukuma, 1969
Matukuma, A.,
Retention indices of alkanes through C10 and alkenes through C8 and relation between boiling points and retention data,
Gas Chromatogr., Int. Symp. Anal. Instrum. Div Instrum Soc. Amer., 1969, 7, 55-75. [all data]
Tourres, 1967
Tourres, D.A.,
Structural analysis of industrial butene dimers by gas chromatography,
J. Gas Chromatogr., 1967, 5, 1, 35-40, https://doi.org/10.1093/chromsci/5.1.35
. [all data]
Waggott and Davies, 1984
Waggott, A.; Davies, I.W.,
Identification of organic pollutants using linear temperature programmed retention indices (LTPRIs) - Part II, 1984, retrieved from http://dwi.defra.gov.uk/research/completed-research/reports/dwi0383.pdf. [all data]
Johanningsmeier and McFeeters, 2011
Johanningsmeier, S.D.; McFeeters, R.F.,
Detection of volatile spoilage metabolites in fermented cucumbers using nontargeted, comprehensive 2-dimensional gas chromatography-time-of-flight mass spectrometry (GCxGCxTOFMS),
J. Food Sci., 2011, 76, 1, c168-c177, https://doi.org/10.1111/j.1750-3841.2010.01918.x
. [all data]