1H-Pyrazole, 4,5-dihydro-3,5,5-trimethyl-
- Formula: C6H12N2
- Molecular weight: 112.1729
- IUPAC Standard InChIKey: MEVTUZFUVAZEPY-UHFFFAOYSA-N
- CAS Registry Number: 3975-85-7
- Chemical structure:
View 3d structure (requires JavaScript / HTML 5) - Other names: 2-Pyrazoline, 3,5,5-trimethyl-; 3,5,5-Trimethyl-2-pyrazoline; 3,5,5-Trimethylpyrazoline; 3,5,5-Trimethyl-Δ[2]-pyrazoline

Normal alkane RI, non-polar column, temperature ramp

Column type | Active phase | I | Reference | Comment |
---|---|---|---|---|
Capillary | OV-101 | 910. | Zenkevich, 2005 | 25. m/0.20 mm/0.10 μm, N2/He, 6. K/min; Tstart: 50. C; Tend: 250. C |

References

Zenkevich, 2005
Zenkevich, I.G.,
Experimentally measured retention indices., 2005. [all data]