m-Tert-butyl chlorobenzene
- Formula: C10H13Cl
- Molecular weight: 168.663
- IUPAC Standard InChIKey: KYXNATZCTBFSTH-UHFFFAOYSA-N
- CAS Registry Number: 3972-55-2
- Chemical structure:
View 3d structure (requires JavaScript / HTML 5) - Permanent link for this species. Use this link for bookmarking this species for future reference.

Condensed phase thermochemistry data

Data compiled by: Hussein Y. Afeefy, Joel F. Liebman, and Stephen E. Stein
Quantity | Value | Units | Method | Reference | Comment |
---|---|---|---|---|---|
ΔfH°liquid | -109. ± 0.8 | kJ/mol | Eqk | Kovel, Nesterova, et al., 1982 |

Reaction thermochemistry data

Data compiled by: Hussein Y. Afeefy, Joel F. Liebman, and Stephen E. Stein
Individual Reactions
By formula: C6H5Cl + C14H21Cl = 2C10H13Cl
Quantity | Value | Units | Method | Reference | Comment |
---|---|---|---|---|---|
ΔrH° | 0. ± 0.1 | kJ/mol | Eqk | Kovzel, Nesterova, et al., 1981 | liquid phase |
By formula: C10H13Cl = C10H13Cl
Quantity | Value | Units | Method | Reference | Comment |
---|---|---|---|---|---|
ΔrH° | 0.84 ± 0.42 | kJ/mol | Eqk | Kovzel, Nesterova, et al., 1981 | liquid phase |

References

Kovel, Nesterova, et al., 1982
Kovel, E.N.; Nesterova, T.N.; Rozhnov, A.M.,
Heats of formation of tert-butylchlorobenzenes, Deposited Document, SPSTL 385 Khp-D80. Chem. Abst. 97:23198n, 1982, 1-5. [all data]
Kovzel, Nesterova, et al., 1981
Kovzel, E.N.; Nesterova, T.N.; Rozhnov, A.M.; Kartavtseva, T.A.,
Study of equilibrium in in the chlorobenzene-butylchlorobenzenes systems,
Termodin. Organ. Soedin., 1981, 65-68. [all data]