2,4-Dimethyl-3-ethyl-3-pentanol
- Formula: C9H20O
- Molecular weight: 144.2545
- IUPAC Standard InChIKey: PZPYIRQFCOFLGJ-UHFFFAOYSA-N
- CAS Registry Number: 3970-59-0
- Chemical structure:
View 3d structure (requires JavaScript / HTML 5) - Permanent link for this species. Use this link for bookmarking this species for future reference.

Phase change data

Data compiled as indicated in comments:
TRC - Thermodynamics Research Center, NIST Boulder Laboratories, Chris Muzny director
AC - William E. Acree, Jr., James S. Chickos
Quantity | Value | Units | Method | Reference | Comment |
---|---|---|---|---|---|
Tboil | 451.05 | K | N/A | Smith and Creitz, 1951 | Uncertainty assigned by TRC = 2. K; TRC |
Tboil | 451.05 | K | N/A | Howard, Mears, et al., 1947 | Uncertainty assigned by TRC = 2. K; TRC |
Quantity | Value | Units | Method | Reference | Comment |
Tfus | 257.15 | K | N/A | Howard, Mears, et al., 1947 | Uncertainty assigned by TRC = 0.5 K; TRC |
Enthalpy of vaporization
ΔvapH (kJ/mol) | Temperature (K) | Reference | Comment |
---|---|---|---|
50.0 | 384. | Wilhoit and Zwolinski, 1973 | Based on data from 369. to 451. K.; AC |

References

Smith and Creitz, 1951
Smith, F.A.; Creitz, E.C.,
Infrared studies of association in eleven alcohols,
J. Res. Natl. Bur. Stand. (U. S.), 1951, 46, 145. [all data]
Howard, Mears, et al., 1947
Howard, F.L.; Mears, T.W.; Fookson, A.; Pomerantz, P.; Brooks, D.B.,
Preparation and physical properties of several aliphatic hydrocarbons and intermediates,
J. Res. Natl. Bur. Stand. (U. S.), 1947, 38, 365. [all data]
Wilhoit and Zwolinski, 1973
Wilhoit, R.C.; Zwolinski, B.J.,
Physical and thermodynamic properties of aliphatic alcohols,
J. Phys. Chem. Ref. Data Suppl., 1973, 1, 2, 1. [all data]