[S-(R*,S*)]-2,4-dimethyl-1-hexanol
- Formula: C8H18O
- Molecular weight: 130.2279
- IUPAC Standard InChIKey: GDRBQWCGBCJTLB-JGVFFNPUSA-N
- CAS Registry Number: 3965-59-1
- Chemical structure:
View 3d structure (requires JavaScript / HTML 5) - Permanent link for this species. Use this link for bookmarking this species for future reference.

Phase change data

Data compiled by: Thermodynamics Research Center, NIST Boulder Laboratories, Chris Muzny director
Quantity | Value | Units | Method | Reference | Comment |
---|---|---|---|---|---|
Tboil | 450.15 | K | N/A | Hagemeyer and Hudson, 1958 | Uncertainty assigned by TRC = 5. K |
Tboil | 447.15 | K | N/A | Graves, 1931 | Uncertainty assigned by TRC = 3. K |

References

Hagemeyer and Hudson, 1958
Hagemeyer, H.J.; Hudson, G.V.,
, 1958. [all data]
Graves, 1931
Graves, G.D.,
Ind. Eng. Chem., 1931, 23, 1381. [all data]