3-Chloro-4-methylbenzyl alcohol
- Formula: C8H9ClO
- Molecular weight: 156.609
- IUPAC Standard InChIKey: NLRJZTGNCBMNKS-UHFFFAOYSA-N
- CAS Registry Number: 39652-32-9
- Chemical structure:
View 3d structure (requires JavaScript / HTML 5) - Other names: Benzenemethanol, 3-chloro-4-methyl-

Phase change data

Data compiled by: Robert L. Brown and Stephen E. Stein
Reduced pressure boiling point
Tboil (K) | Pressure (bar) | Reference |
---|---|---|
410. to 411. | 0.009 | Frinton Laboratories Inc., 1986 |

References

Frinton Laboratories Inc., 1986
Frinton Laboratories Inc.,
Catalog Number 11, Frinton Laboratories Inc., Vineland, NJ, 1986, 99. [all data]