N,N'-bis(salicylaldehydo)tetramethylenediimine

Phase change data

Data compiled by: William E. Acree, Jr., James S. Chickos

Quantity Value Units Method Reference Comment
Δsub165.1 ± 3.1kJ/molMERibeiro da Silva, Gonçalves, et al., 2004Based on data from 349. - 361. K.

Enthalpy of fusion

ΔfusH (kJ/mol) Temperature (K) Method Reference
35.54362.8DSCRibeiro da Silva, Gonçalves, et al., 2004

References

Ribeiro da Silva, Gonçalves, et al., 2004
Ribeiro da Silva, Maria D.M.C.; Gonçalves, Jorge M.; Silva, Ana L.R.; Silva, Adelina M.R.O.A.; Oliveira, Paula C.F.C.; Ribeiro da Silva, Manuel A.V., Experimental study of the energetics of tetradentate N2O2 Schiff bases derived from salicylaldehyde, Thermochimica Acta, 2004, 420, 1-2, 67-71, https://doi.org/10.1016/j.tca.2003.09.038 . [all data]