Butanoic acid, 2-oxo-, methyl ester
- Formula: C5H8O3
- Molecular weight: 116.1152
- IUPAC Standard InChIKey: XPIWVCAMONZQCP-UHFFFAOYSA-N
- CAS Registry Number: 3952-66-7
- Chemical structure:
View 3d structure (requires JavaScript / HTML 5) - Other names: Butyric acid, 2-oxo-, methyl ester; Methyl α-oxobutyrate; Methyl 2-oxobutyrate; Methyl ester of 2-oxobutanoic acid; 2-Ketobutyric acid, methyl ester; Methyl 2-oxobutanoate

Van Den Dool and Kratz RI, non-polar column, custom temperature program

Column type | Active phase | I | Reference | Comment |
---|---|---|---|---|
Capillary | VF-5MS | 832.4 | Tret'yakov, 2007 | 30. m/0.25 mm/0.25 μm, He; Program: Multi-step temperature program; T(initial)=60C; T(final)=270C |

Van Den Dool and Kratz RI, polar column, temperature ramp

Column type | Active phase | I | Reference | Comment |
---|---|---|---|---|
Capillary | DB-Wax | 1372. | Fröhlich, Duque, et al., 1989 | 30. m/0.25 mm/0.25 μm, He, 50. C @ 3. min, 4. K/min; Tend: 250. C |
Capillary | DB-Wax | 1375. | Fröhlich, Duque, et al., 1989 | 30. m/0.25 mm/0.25 μm, He, 50. C @ 3. min, 4. K/min; Tend: 250. C |

References

Tret'yakov, 2007
Tret'yakov, K.V.,
Retention Data. NIST Mass Spectrometry Data Center., NIST Mass Spectrometry Data Center, 2007. [all data]
Fröhlich, Duque, et al., 1989
Fröhlich, O.; Duque, C.; Schreier, P.,
Volatile constituents of curuba (Passiflora mollissima) fruit,
J. Agric. Food Chem., 1989, 37, 2, 421-425, https://doi.org/10.1021/jf00086a033
. [all data]