(dl) m-fluoromandelic acid

Phase change data

Data compiled by: William E. Acree, Jr., James S. Chickos

Enthalpy of fusion

ΔfusH (kJ/mol) Temperature (K) Reference Comment
24.69370.Chickos, Braton, et al., 1991See also Larsen and Marthi, 1994.

References

Chickos, Braton, et al., 1991
Chickos, James S.; Braton, C. Marie; Hesse, Donald G.; Liebman, Joel F., Estimating entropies and enthalpies of fusion of organic compounds, J. Org. Chem., 1991, 56, 3, 927-938, https://doi.org/10.1021/jo00003a007 . [all data]

Larsen and Marthi, 1994
Larsen, S.; Marthi, K., Structures of racemic monofluoro-substituted mandelic acids, their relation to the thermochemical properties and an analysis of short intermolecular fluorine--carbon contacts, Acta Crystallogr Sect B Struct Sci, 1994, 50, 3, 373-381, https://doi.org/10.1107/S0108768193010766 . [all data]