2,2'-4,4'-5,5'-hexamethyl-1,1'-biphenyl
- Formula: C18H22
- Molecular weight: 238.3673
- IUPAC Standard InChIKey: YDNZPEQAXQIUAW-UHFFFAOYSA-N
- CAS Registry Number: 39502-96-0
- Chemical structure:
View 3d structure (requires JavaScript / HTML 5) - Permanent link for this species. Use this link for bookmarking this species for future reference.

Phase change data

Data compiled by: Thermodynamics Research Center, NIST Boulder Laboratories, Chris Muzny director
Quantity | Value | Units | Method | Reference | Comment |
---|---|---|---|---|---|
Tfus | 325. | K | N/A | Ullmann, 1904 | Uncertainty assigned by TRC = 4. K |

References

Ullmann, 1904
Ullmann, F.,
Justus Liebigs Ann. Chem., 1904, 332, 38. [all data]