4-Fluoro-2-nitrophenol
- Formula: C6H4FNO3
- Molecular weight: 157.0993
- IUPAC Standard InChIKey: ZHRLVDHMIJDWSS-UHFFFAOYSA-N
- CAS Registry Number: 394-33-2
- Chemical structure:
View 3d structure (requires JavaScript / HTML 5) - Other names: Phenol, 4-fluoro-2-nitro-

Condensed phase thermochemistry data

Data compiled by: Hussein Y. Afeefy, Joel F. Liebman, and Stephen E. Stein
Quantity | Value | Units | Method | Reference | Comment |
---|---|---|---|---|---|
ΔcH°solid | -652.75 | kcal/mol | Ccb | Swarts, 1919 | Not corrected for CODATA value of ΔfH |

References

Swarts, 1919
Swarts, F.,
Etudes thermochimiques sur les combinaisons organiques fluorees,
J. Chim. Phys., 1919, 17, 3-70. [all data]