Acetic acid, methoxy-, ethyl ester
- Formula: C5H10O3
- Molecular weight: 118.1311
- IUPAC Standard InChIKey: JLEKJZUYWFJPMB-UHFFFAOYSA-N
- CAS Registry Number: 3938-96-3
- Chemical structure:
View 3d structure (requires JavaScript / HTML 5) - Other names: Ethyl methoxyacetate; Methylglycol acetate; Methoxyacetic acid, ethyl ester; Ethanol, 2-metoxy-acetate

Phase change data

Data compiled by: Robert L. Brown and Stephen E. Stein
Reduced pressure boiling point
Tboil (K) | Pressure (bar) | Reference |
---|---|---|
317.7 | 0.01 | Weast and Grasselli, 1989 |

Van Den Dool and Kratz RI, non-polar column, custom temperature program

Column type | Active phase | I | Reference | Comment |
---|---|---|---|---|
Capillary | VF-5MS | 836. | Tretyakov, 2011 | 30. m/0.25 mm/0.25 μm, He; Program: Multi-step temperature program; T(initial)=60C; T(final)=270C |

Normal alkane RI, non-polar column, custom temperature program

Column type | Active phase | I | Reference | Comment |
---|---|---|---|---|
Capillary | BPX-5 | 845. | Duflos, Moine, et al., 2005 | 60. m/0.25 mm/0.25 μm, He; Program: 40C(5min) => 5C/min => 100C => 20C/min => 280C (5min) |

References

Weast and Grasselli, 1989
CRC Handbook of Data on Organic Compounds, 2nd Editon, Weast,R.C and Grasselli, J.G., ed(s)., CRC Press, Inc., Boca Raton, FL, 1989, 1. [all data]
Tretyakov, 2011
Tretyakov, K.V.,
Retention Data. NIST Mass Spectrometry Data Center., NIST Mass Spectrometry Data Center, 2011. [all data]
Duflos, Moine, et al., 2005
Duflos, G.; Moine, F.; Coin, V.M.; Malle, P.,
Determination of volatile compounds in whiting (Merlangius merlangus) using headspace-solid-phase microextraction-gas chromatography-mass spectrometry,
J. Chromatogr. Sci., 2005, 43, 6, 304-312, https://doi.org/10.1093/chromsci/43.6.304
. [all data]