Pyrimidine, 2,4-dichloro-
- Formula: C4H2Cl2N2
- Molecular weight: 148.978
- IUPAC Standard InChIKey: BTTNYQZNBZNDOR-UHFFFAOYSA-N
- CAS Registry Number: 3934-20-1
- Chemical structure:
View 3d structure (requires JavaScript / HTML 5) - Other names: 2,4-Dichloropyrimidine; 2,6-Dichloropyrimidine

Phase change data

Data compiled as indicated in comments:
BS - Robert L. Brown and Stephen E. Stein
AC - William E. Acree, Jr., James S. Chickos
Quantity | Value | Units | Method | Reference | Comment |
---|---|---|---|---|---|
ΔsubH° | 76.5 ± 2.0 | kJ/mol | C | Ribeiro da Silva, Amaral, et al., 2007 | AC |
Reduced pressure boiling point
Tboil (K) | Pressure (bar) | Reference | Comment |
---|---|---|---|
374.2 | 0.031 | Weast and Grasselli, 1989 | BS |

References

Ribeiro da Silva, Amaral, et al., 2007
Ribeiro da Silva, Manuel A.V.; Amaral, Luísa M.P.F.; Gomes, José R.B.,
Comparative Computational and Experimental Study on the Thermochemistry of the Chloropyrimidines,
J. Phys. Chem. B, 2007, 111, 4, 792-799, https://doi.org/10.1021/jp0664723
. [all data]
Weast and Grasselli, 1989
CRC Handbook of Data on Organic Compounds, 2nd Editon, Weast,R.C and Grasselli, J.G., ed(s)., CRC Press, Inc., Boca Raton, FL, 1989, 1. [all data]
(editor), 1975
(editor), Koptyug V.A.,
Atlas of Spectra of Aromatic and Heterocyclic Compounds, 1975, 8, 76. [all data]