Bis(η5-cyclopentadienyl)dimethyl tungsten
- Formula: C12H16W
- Molecular weight: 344.10
- CAS Registry Number: 39333-53-4

Gas phase thermochemistry data

Data compiled by: José A. Martinho Simões
Quantity | Value | Units | Method | Reference | Comment |
---|---|---|---|---|---|
ΔfH°gas | 346.2 ± 8.7 | kJ/mol | Review | Martinho Simões | The enthalpy of formation relies on -63.1 ± 7.2 kJ/mol for the enthalpy of formation of W(Cp)2(Cl)2(cr) |

Condensed phase thermochemistry data

Data compiled by: José A. Martinho Simões
Quantity | Value | Units | Method | Reference | Comment |
---|---|---|---|---|---|
ΔfH°solid | 271.6 ± 7.6 | kJ/mol | Review | Martinho Simões | The enthalpy of formation relies on -63.1 ± 7.2 kJ/mol for the enthalpy of formation of W(Cp)2(Cl)2(cr) |

Phase change data

Data compiled by: José A. Martinho Simões
Quantity | Value | Units | Method | Reference | Comment |
---|---|---|---|---|---|
ΔsubH° | 74.6 ± 4.2 | kJ/mol | RSC | Calado, Dias, et al., 1980 |

Reaction thermochemistry data

Data compiled by: José A. Martinho Simões
Individual Reactions
C12H16W (cr) + 2( • 5.55
) (solution) = C10H10Cl2W (cr) + 2
(g)
By formula: C12H16W (cr) + 2(HCl • 5.55H2O) (solution) = C10H10Cl2W (cr) + 2CH4 (g)
Quantity | Value | Units | Method | Reference | Comment |
---|---|---|---|---|---|
ΔrH° | -169.9 ± 2.3 | kJ/mol | RSC | Calado, Dias, et al., 1978 | Please also see Calhorda, Dias, et al., 1987. |

Gas phase ion energetics data

Data compiled as indicated in comments:
LLK - Sharon G. Lias, Rhoda D. Levin, and Sherif A. Kafafi
Ionization energy determinations
IE (eV) | Method | Reference | Comment |
---|---|---|---|
5.8 | PE | Green, Jackson, et al., 1975 | LLK |
6.0 ± 0.1 | PE | Green, Jackson, et al., 1975 | Vertical value; LLK |

References

Martinho Simões
Martinho Simões, J.A.,
Private communication (see http://webbook.nist.gov/chemistry/om/). [all data]
Calado, Dias, et al., 1980
Calado, J.C.G.; Dias, A.R.; Minas da Piedade M.E.; Martinho Simões, J.A.,
Rev. Port. Quím., 1980, 22, 57. [all data]
Calado, Dias, et al., 1978
Calado, J.C.G.; Dias, A.R.; Martinho Simões, J.A.; Ribeiro da Silva, M.A.V.,
J. Chem. Soc., Chem. Commun., 1978, 737.. [all data]
Calhorda, Dias, et al., 1987
Calhorda, M.J.; Dias, A.R.; Minas da Piedade M.E.; Salema, M.S.; Martinho Simões J.A.,
Organometallics, 1987, 6, 734. [all data]