Molybdenum,bis(η5-2,4-cyclopentadien-1-yl)dimethyl-
- Formula: C12H16Mo
- Molecular weight: 256.22
- CAS Registry Number: 39333-52-3

Gas phase thermochemistry data

Data compiled by: José A. Martinho Simões
Quantity | Value | Units | Method | Reference | Comment |
---|---|---|---|---|---|
ΔfH°gas | 332.5 ± 5.9 | kJ/mol | Review | Martinho Simões | The enthalpy of formation relies on -96.3 ± 2.9 kJ/mol for the enthalpy of formation of Mo(Cp)2(Cl)2(cr) |
ΔfH°gas | 308.4 ± 7.0 | kJ/mol | Review | Martinho Simões | Selected data. The enthalpy of formation relies on -96.3 ± 2.9 kJ/mol for the enthalpy of formation of Mo(Cp)2(Cl)2(cr) |

Condensed phase thermochemistry data

Data compiled by: José A. Martinho Simões
Quantity | Value | Units | Method | Reference | Comment |
---|---|---|---|---|---|
ΔfH°solid | 262.1 ± 4.2 | kJ/mol | Review | Martinho Simões | The enthalpy of formation relies on -96.3 ± 2.9 kJ/mol for the enthalpy of formation of Mo(Cp)2(Cl)2(cr) |
ΔfH°solid | 238.0 ± 5.6 | kJ/mol | Review | Martinho Simões | Selected data. The enthalpy of formation relies on -96.3 ± 2.9 kJ/mol for the enthalpy of formation of Mo(Cp)2(Cl)2(cr) |

Phase change data

Data compiled as indicated in comments:
AC - William E. Acree, Jr., James S. Chickos
MS - José A. Martinho Simões
Quantity | Value | Units | Method | Reference | Comment |
---|---|---|---|---|---|
ΔsubH° | 70.4 ± 4.2 | kJ/mol | N/A | Pilcher and Skinner, 1983 | See also Pablo, 2000.; AC |
ΔsubH° | 70.4 ± 4.2 | kJ/mol | RSC | Calado, Dias, et al., 1980 | MS |

Reaction thermochemistry data

Data compiled by: José A. Martinho Simões
Individual Reactions
C12H16Mo (cr) + 2( • 5.55
) (solution) = C10H10Cl2Mo (cr) + 2
(g)
By formula: C12H16Mo (cr) + 2(HCl • 5.55H2O) (solution) = C10H10Cl2Mo (cr) + 2CH4 (g)
Quantity | Value | Units | Method | Reference | Comment |
---|---|---|---|---|---|
ΔrH° | -193.6 ± 3.0 | kJ/mol | RSC | Calado, Dias, et al., 1978 | Please also see Calhorda, Dias, et al., 1987. |

Gas phase ion energetics data

Data compiled as indicated in comments:
LLK - Sharon G. Lias, Rhoda D. Levin, and Sherif A. Kafafi
Ionization energy determinations
IE (eV) | Method | Reference | Comment |
---|---|---|---|
6.1 ± 0.1 | PE | Green, Jackson, et al., 1975 | Vertical value; LLK |

References

Martinho Simões
Martinho Simões, J.A.,
Private communication (see http://webbook.nist.gov/chemistry/om/). [all data]
Pilcher and Skinner, 1983
Pilcher, G.; Skinner, H.A.,
Thermochemistry of organometallic compounds, 1983, 43-90, https://doi.org/10.1002/9780470771686.ch2
. [all data]
Pablo, 2000
Pablo, R.S. De,
The vapour pressure of tetrachloroisophthalonitrile by the effusion method,
J. Phys. D: Appl. Phys., 2000, 13, 2, 313-319, https://doi.org/10.1088/0022-3727/13/2/028
. [all data]
Calado, Dias, et al., 1980
Calado, J.C.G.; Dias, A.R.; Minas da Piedade M.E.; Martinho Simões, J.A.,
Rev. Port. Quím., 1980, 22, 57. [all data]
Calado, Dias, et al., 1978
Calado, J.C.G.; Dias, A.R.; Martinho Simões, J.A.; Ribeiro da Silva, M.A.V.,
J. Chem. Soc., Chem. Commun., 1978, 737.. [all data]
Calhorda, Dias, et al., 1987
Calhorda, M.J.; Dias, A.R.; Minas da Piedade M.E.; Salema, M.S.; Martinho Simões J.A.,
Organometallics, 1987, 6, 734. [all data]