Benzene, 1-fluoro-2-(trifluoromethyl)-
- Formula: C7H4F4
- Molecular weight: 164.1003
- IUPAC Standard InChIKey: BGVGHYOIWIALFF-UHFFFAOYSA-N
- CAS Registry Number: 392-85-8
- Chemical structure:
View 3d structure (requires JavaScript / HTML 5) - Other names: o-Fluorobenzotrifluoride; 2-Fluorobenzotrifluoride; o,α,α,α-Tetrafluorotoluene; Toluene, α,α,α,o-tetrafluoro-; Toluene, o,α,α,α-tetrafluoro-; 1-Fluoro-2-(trifluoromethyl)benzene; o,alpha,alpha,alpha-Tetrafluorotoluene; NSC 10314; α,α,α,2-tetrafluorotoluene

Phase change data

Data compiled as indicated in comments:
BS - Robert L. Brown and Stephen E. Stein
AC - William E. Acree, Jr., James S. Chickos
Quantity | Value | Units | Method | Reference | Comment |
---|---|---|---|---|---|
Tboil | 387. to 388. | K | N/A | PCR Inc., 1990 | BS |
Quantity | Value | Units | Method | Reference | Comment |
ΔvapH° | 38.1 | kJ/mol | N/A | Boublik, Fried, et al., 1984 | Based on data from 310. to 410. K. See also Basarová and Svoboda, 1991.; AC |
Reduced pressure boiling point
Tboil (K) | Pressure (bar) | Reference | Comment |
---|---|---|---|
387.7 | 1.00 | Aldrich Chemical Company Inc., 1990 | BS |
Enthalpy of fusion
ΔfusH (kJ/mol) | Temperature (K) | Method | Reference | Comment |
---|---|---|---|---|
10.7 | 222. | DSC | Ahmed and Eades, 1972 | AC |

References

PCR Inc., 1990
PCR Inc.,
Research Chemicals Catalog 1990-1991, PCR Inc., Gainesville, FL, 1990, 1. [all data]
Boublik, Fried, et al., 1984
Boublik, T.; Fried, V.; Hala, E.,
The Vapour Pressures of Pure Substances: Selected Values of the Temperature Dependence of the Vapour Pressures of Some Pure Substances in the Normal and Low Pressure Region, 2nd ed., Elsevier, New York, 1984, 972. [all data]
Basarová and Svoboda, 1991
Basarová, Pavlína; Svoboda, Václav,
Calculation of heats of vaporization of halogenated hydrocarbons from saturated vapour pressure data,
Fluid Phase Equilibria, 1991, 68, 13-34, https://doi.org/10.1016/0378-3812(91)85008-I
. [all data]
Aldrich Chemical Company Inc., 1990
Aldrich Chemical Company Inc.,
Catalog Handbook of Fine Chemicals, Aldrich Chemical Company, Inc., Milwaukee WI, 1990, 1. [all data]
Ahmed and Eades, 1972
Ahmed, A.M.I.; Eades, R.G.,
Proton magnetic relaxation in toluene and some derivatives,
J. Chem. Soc., Faraday Trans. 2, 1972, 68, 1623, https://doi.org/10.1039/f29726801623
. [all data]