Benzo[f]quinoline, 2-methyl-
- Formula: C14H11N
- Molecular weight: 193.2438
- IUPAC Standard InChIKey: GDYIXQSZWGQBMB-UHFFFAOYSA-N
- CAS Registry Number: 39258-30-5
- Chemical structure:
View 3d structure (requires JavaScript / HTML 5) - Other names: 2-Methylbenzo[f]quinoline

Phase change data

Data compiled by: Thermodynamics Research Center, NIST Boulder Laboratories, Chris Muzny director
Quantity | Value | Units | Method | Reference | Comment |
---|---|---|---|---|---|
Tfus | 355. | K | N/A | Kost, Yurkevich, et al., 1955 | Uncertainty assigned by TRC = 3. K |

Lee's RI, non-polar column, temperature ramp

Column type | Active phase | I | Reference | Comment |
---|---|---|---|---|
Capillary | SE-52 | 320.50 | Vassilaros, Kong, et al., 1982 | 20. m/0.30 mm/0.25 μm, H2, 40. C @ 2. min, 4. K/min; Tend: 265. C |

References

Kost, Yurkevich, et al., 1955
Kost, A.N.; Yurkevich, A.M.; Yudin, L.G.; Shchegoleva, T.A.,
Reaction of vinyl ethers with amines.,
Zh. Obshch. Khim., 1955, 25, 943-7. [all data]
Vassilaros, Kong, et al., 1982
Vassilaros, D.L.; Kong, R.C.; Later, D.W.; Lee, M.L.,
Linear retention index system for polycyclic aromatic compounds. Critical evaluation and additional indices,
J. Chromatogr., 1982, 252, 1-20, https://doi.org/10.1016/S0021-9673(01)88394-1
. [all data]